setup
checks.aarch64-darwin.psql_17_slim
· build #53
· raw
1this derivation will be built:2 /nix/store/k5b385zfli1gw9jkyndq1r1k9ggf85sm-run-check-harness-psql-17-slim.drv3error: build of '/nix/store/k5b385zfli1gw9jkyndq1r1k9ggf85sm-run-check-harness-psql-17-slim.drv' on 'ssh-ng://nixbot-remote-build@62.210.193.142' failed: Cannot build '/nix/store/k5b385zfli1gw9jkyndq1r1k9ggf85sm-run-check-harness-psql-17-slim.drv'.4 Reason: builder failed with exit code 1.5 Output paths:6 /nix/store/s18nvgix33djv22sdsb1b2pmy3k5kl7x-run-check-harness-psql-17-slim7 Last 25 log lines:8 > test roles ... ok 18 ms9 > test security ... ok 17 ms10 > test storage ... ok 20 ms11 > test supautils_reserved_roles ... ok 15 ms12 > test supautils_restrict_versions ... ok 50 ms13 > test vault ... ok 28 ms14 > test wal2json ... ok 20 ms15 > test z_17_ext_interface ... FAILED 79 ms16 > test z_17_intarray_ltree_query ... ok 21 ms17 > test z_17_pg_stat_monitor ... ok 16 ms18 > test z_17_pgvector ... ok 20 ms19 > test z_17_roles ... ok 20 ms20 > test z_17_rum ... ok 21 ms21 >22 > =======================23 > 3 of 67 tests failed.24 > =======================25 >26 > The differences that caused some tests to fail can be viewed in the27 > file "/nix/store/s18nvgix33djv22sdsb1b2pmy3k5kl7x-run-check-harness-psql-17-slim/regression_output/regression.diffs". A copy of the test summary that you see28 > above is saved in the file "/nix/store/s18nvgix33djv22sdsb1b2pmy3k5kl7x-run-check-harness-psql-17-slim/regression_output/regression.out".29 >30 > 2026-10-05 16:40:38 [ERROR] pg_regress tests failed31 > 2026-10-05 16:40:38 [ERROR] An error occurred. Exit code: 132 > 2026-10-05 16:40:38 [ERROR] Debug logs:33 For full logs, run:34 nix log /nix/store/k5b385zfli1gw9jkyndq1r1k9ggf85sm-run-check-harness-psql-17-slim.drv35error: Cannot build '/nix/store/k5b385zfli1gw9jkyndq1r1k9ggf85sm-run-check-harness-psql-17-slim.drv'.36 Reason: builder failed with exit code 1.37 Output paths:38 /nix/store/s18nvgix33djv22sdsb1b2pmy3k5kl7x-run-check-harness-psql-17-slim