this derivation will be built: /nix/store/k5b385zfli1gw9jkyndq1r1k9ggf85sm-run-check-harness-psql-17-slim.drv error: build of '/nix/store/k5b385zfli1gw9jkyndq1r1k9ggf85sm-run-check-harness-psql-17-slim.drv' on 'ssh-ng://nixbot-remote-build@62.210.193.142' failed: Cannot build '/nix/store/k5b385zfli1gw9jkyndq1r1k9ggf85sm-run-check-harness-psql-17-slim.drv'. Reason: builder failed with exit code 1. Output paths: /nix/store/s18nvgix33djv22sdsb1b2pmy3k5kl7x-run-check-harness-psql-17-slim Last 25 log lines: > test roles ... ok 18 ms > test security ... ok 17 ms > test storage ... ok 20 ms > test supautils_reserved_roles ... ok 15 ms > test supautils_restrict_versions ... ok 50 ms > test vault ... ok 28 ms > test wal2json ... ok 20 ms > test z_17_ext_interface ... FAILED 79 ms > test z_17_intarray_ltree_query ... ok 21 ms > test z_17_pg_stat_monitor ... ok 16 ms > test z_17_pgvector ... ok 20 ms > test z_17_roles ... ok 20 ms > test z_17_rum ... ok 21 ms > > ======================= > 3 of 67 tests failed. > ======================= > > The differences that caused some tests to fail can be viewed in the > file "/nix/store/s18nvgix33djv22sdsb1b2pmy3k5kl7x-run-check-harness-psql-17-slim/regression_output/regression.diffs". A copy of the test summary that you see > above is saved in the file "/nix/store/s18nvgix33djv22sdsb1b2pmy3k5kl7x-run-check-harness-psql-17-slim/regression_output/regression.out". > > 2026-10-05 16:40:38 [ERROR] pg_regress tests failed > 2026-10-05 16:40:38 [ERROR] An error occurred. Exit code: 1 > 2026-10-05 16:40:38 [ERROR] Debug logs: For full logs, run: nix log /nix/store/k5b385zfli1gw9jkyndq1r1k9ggf85sm-run-check-harness-psql-17-slim.drv error: Cannot build '/nix/store/k5b385zfli1gw9jkyndq1r1k9ggf85sm-run-check-harness-psql-17-slim.drv'. Reason: builder failed with exit code 1. Output paths: /nix/store/s18nvgix33djv22sdsb1b2pmy3k5kl7x-run-check-harness-psql-17-slim