nixbot

builds

supabase/postgres build #53 failed

branch develop · PR #2433 · commit 2f92da0d31 · · took 3h 10m · eval 4m 0s

7 failed
failed attributes
status attribute duration
failed checks.aarch64-darwin.psql_15 1m 23s
run-check-harness-psql-15: 3 of 71 tests failed. ======================= The differences that caused some tests to fail can be viewed in the file "/nix/store/ …
run-check-harness-psql-15:
 3 of 71 tests failed. 
=======================
The differences that caused some tests to fail can be viewed in the
file "/nix/store/53ifnqhlfprzkhhdwj37r2h8qf9kq1rn-run-check-harness-psql-15/regression_output/regression.diffs".  A copy of the test summary that you see
above is saved in the file "/nix/store/53ifnqhlfprzkhhdwj37r2h8qf9kq1rn-run-check-harness-psql-15/regression_output/regression.out".
2026-10-05 16:40:32 [ERROR] pg_regress tests failed
2026-10-05 16:40:32 [ERROR] An error occurred. Exit code: 1
2026-10-05 16:40:32 [ERROR] Debug logs:
failed checks.aarch64-darwin.psql_15_slim 1m 14s
run-check-harness-psql-15-slim: 3 of 71 tests failed. ======================= The differences that caused some tests to fail can be viewed in the file "/nix/s …
run-check-harness-psql-15-slim:
 3 of 71 tests failed. 
=======================
The differences that caused some tests to fail can be viewed in the
file "/nix/store/0a5vk4jhs4zhnhq71dqa31y3k7nsp54g-run-check-harness-psql-15-slim/regression_output/regression.diffs".  A copy of the test summary that you see
above is saved in the file "/nix/store/0a5vk4jhs4zhnhq71dqa31y3k7nsp54g-run-check-harness-psql-15-slim/regression_output/regression.out".
2026-10-05 16:40:34 [ERROR] pg_regress tests failed
2026-10-05 16:40:34 [ERROR] An error occurred. Exit code: 1
2026-10-05 16:40:34 [ERROR] Debug logs:
failed checks.aarch64-darwin.psql_17 40s
run-check-harness-psql-17: 2 of 67 tests failed. ======================= The differences that caused some tests to fail can be viewed in the file "/nix/store/ …
run-check-harness-psql-17:
 2 of 67 tests failed. 
=======================
The differences that caused some tests to fail can be viewed in the
file "/nix/store/2n5nqavmq2ryy18w8hwwl1iqivrgp3mi-run-check-harness-psql-17/regression_output/regression.diffs".  A copy of the test summary that you see
above is saved in the file "/nix/store/2n5nqavmq2ryy18w8hwwl1iqivrgp3mi-run-check-harness-psql-17/regression_output/regression.out".
2026-10-05 16:40:14 [ERROR] pg_regress tests failed
2026-10-05 16:40:14 [ERROR] An error occurred. Exit code: 1
2026-10-05 16:40:14 [ERROR] Debug logs:
failed checks.aarch64-darwin.psql_17_slim 45s
run-check-harness-psql-17-slim: 3 of 67 tests failed. ======================= The differences that caused some tests to fail can be viewed in the file "/nix/s …
run-check-harness-psql-17-slim:
 3 of 67 tests failed. 
=======================
The differences that caused some tests to fail can be viewed in the
file "/nix/store/s18nvgix33djv22sdsb1b2pmy3k5kl7x-run-check-harness-psql-17-slim/regression_output/regression.diffs".  A copy of the test summary that you see
above is saved in the file "/nix/store/s18nvgix33djv22sdsb1b2pmy3k5kl7x-run-check-harness-psql-17-slim/regression_output/regression.out".
2026-10-05 16:40:38 [ERROR] pg_regress tests failed
2026-10-05 16:40:38 [ERROR] An error occurred. Exit code: 1
2026-10-05 16:40:38 [ERROR] Debug logs:
failed checks.aarch64-darwin.psql_orioledb-17 1m 3s
run-check-harness-psql-orioledb-17: 3 of 64 tests failed. ======================= The differences that caused some tests to fail can be viewed in the file "/n …
run-check-harness-psql-orioledb-17:
 3 of 64 tests failed. 
=======================
The differences that caused some tests to fail can be viewed in the
file "/nix/store/qb5bhah8xvmr14ncsf6kvyqndxgx43c7-run-check-harness-psql-orioledb-17/regression_output/regression.diffs".  A copy of the test summary that you see
above is saved in the file "/nix/store/qb5bhah8xvmr14ncsf6kvyqndxgx43c7-run-check-harness-psql-orioledb-17/regression_output/regression.out".
2026-10-05 16:40:50 [ERROR] pg_regress tests failed
2026-10-05 16:40:50 [ERROR] An error occurred. Exit code: 1
2026-10-05 16:40:50 [ERROR] Debug logs:
failed checks.aarch64-darwin.psql_orioledb-17_slim 44s
run-check-harness-psql-orioledb-17-slim: 2 of 64 tests failed. ======================= The differences that caused some tests to fail can be viewed in the fil …
run-check-harness-psql-orioledb-17-slim:
 2 of 64 tests failed. 
=======================
The differences that caused some tests to fail can be viewed in the
file "/nix/store/76rw2hqxx65f58j32c69acvk1j9nlkj5-run-check-harness-psql-orioledb-17-slim/regression_output/regression.diffs".  A copy of the test summary that you see
above is saved in the file "/nix/store/76rw2hqxx65f58j32c69acvk1j9nlkj5-run-check-harness-psql-orioledb-17-slim/regression_output/regression.out".
2026-10-05 16:40:48 [ERROR] pg_regress tests failed
2026-10-05 16:40:49 [ERROR] An error occurred. Exit code: 1
2026-10-05 16:40:49 [ERROR] Debug logs:
failed checks.aarch64-linux.psql_17 44s
run-check-harness-psql-17: 2 of 67 tests failed. ======================= The differences that caused some tests to fail can be viewed in the file "/nix/store/ …
run-check-harness-psql-17:
 2 of 67 tests failed. 
=======================
The differences that caused some tests to fail can be viewed in the
file "/nix/store/xm747qvxvnd7vz94p60pqsx8m4g1dvi5-run-check-harness-psql-17/regression_output/regression.diffs".  A copy of the test summary that you see
above is saved in the file "/nix/store/xm747qvxvnd7vz94p60pqsx8m4g1dvi5-run-check-harness-psql-17/regression_output/regression.out".
2026-10-05 16:41:29 [ERROR] pg_regress tests failed
2026-10-05 16:41:29 [ERROR] An error occurred. Exit code: 1
2026-10-05 16:41:29 [ERROR] Debug logs:
13 cancelled
cancelled attributes
status attribute duration
loading…
7 succeeded
succeeded attributes
status attribute duration
loading…
152 already built
skipped attributes
status attribute duration
loading…