setup
checks.aarch64-darwin.psql_15
· build #53
· raw
1this derivation will be built:2 /nix/store/asj2m6qlrw1h5qgl5s08wygaqya0p5b6-run-check-harness-psql-15.drv3error: build of '/nix/store/asj2m6qlrw1h5qgl5s08wygaqya0p5b6-run-check-harness-psql-15.drv' on 'ssh-ng://nixbot-remote-build@62.210.193.142' failed: Cannot build '/nix/store/asj2m6qlrw1h5qgl5s08wygaqya0p5b6-run-check-harness-psql-15.drv'.4 Reason: builder failed with exit code 1.5 Output paths:6 /nix/store/53ifnqhlfprzkhhdwj37r2h8qf9kq1rn-run-check-harness-psql-157 Last 25 log lines:8 > test supautils_restrict_versions ... ok 53 ms9 > test vault ... ok 35 ms10 > test wal2json ... ok 25 ms11 > test z_15_ext_interface ... FAILED 589 ms12 > test z_15_intarray_ltree_query ... ok 19 ms13 > test z_15_pg_stat_monitor ... ok 22 ms14 > test z_15_pgjwt ... ok 29 ms15 > test z_15_pgvector ... ok 49 ms16 > test z_15_plv8 ... ok 299 ms17 > test z_15_roles ... ok 24 ms18 > test z_15_rum ... ok 30 ms19 > test z_15_timescale ... ok 29 ms20 > test z_15_unhype_timescale_to_partman ... ok 8555 ms21 >22 > =======================23 > 3 of 71 tests failed.24 > =======================25 >26 > The differences that caused some tests to fail can be viewed in the27 > file "/nix/store/53ifnqhlfprzkhhdwj37r2h8qf9kq1rn-run-check-harness-psql-15/regression_output/regression.diffs". A copy of the test summary that you see28 > above is saved in the file "/nix/store/53ifnqhlfprzkhhdwj37r2h8qf9kq1rn-run-check-harness-psql-15/regression_output/regression.out".29 >30 > 2026-10-05 16:40:32 [ERROR] pg_regress tests failed31 > 2026-10-05 16:40:32 [ERROR] An error occurred. Exit code: 132 > 2026-10-05 16:40:32 [ERROR] Debug logs:33 For full logs, run:34 nix log /nix/store/asj2m6qlrw1h5qgl5s08wygaqya0p5b6-run-check-harness-psql-15.drv35error: Cannot build '/nix/store/asj2m6qlrw1h5qgl5s08wygaqya0p5b6-run-check-harness-psql-15.drv'.36 Reason: builder failed with exit code 1.37 Output paths:38 /nix/store/53ifnqhlfprzkhhdwj37r2h8qf9kq1rn-run-check-harness-psql-15