this derivation will be built: /nix/store/asj2m6qlrw1h5qgl5s08wygaqya0p5b6-run-check-harness-psql-15.drv error: build of '/nix/store/asj2m6qlrw1h5qgl5s08wygaqya0p5b6-run-check-harness-psql-15.drv' on 'ssh-ng://nixbot-remote-build@62.210.193.142' failed: Cannot build '/nix/store/asj2m6qlrw1h5qgl5s08wygaqya0p5b6-run-check-harness-psql-15.drv'. Reason: builder failed with exit code 1. Output paths: /nix/store/53ifnqhlfprzkhhdwj37r2h8qf9kq1rn-run-check-harness-psql-15 Last 25 log lines: > test supautils_restrict_versions ... ok 53 ms > test vault ... ok 35 ms > test wal2json ... ok 25 ms > test z_15_ext_interface ... FAILED 589 ms > test z_15_intarray_ltree_query ... ok 19 ms > test z_15_pg_stat_monitor ... ok 22 ms > test z_15_pgjwt ... ok 29 ms > test z_15_pgvector ... ok 49 ms > test z_15_plv8 ... ok 299 ms > test z_15_roles ... ok 24 ms > test z_15_rum ... ok 30 ms > test z_15_timescale ... ok 29 ms > test z_15_unhype_timescale_to_partman ... ok 8555 ms > > ======================= > 3 of 71 tests failed. > ======================= > > The differences that caused some tests to fail can be viewed in the > file "/nix/store/53ifnqhlfprzkhhdwj37r2h8qf9kq1rn-run-check-harness-psql-15/regression_output/regression.diffs". A copy of the test summary that you see > above is saved in the file "/nix/store/53ifnqhlfprzkhhdwj37r2h8qf9kq1rn-run-check-harness-psql-15/regression_output/regression.out". > > 2026-10-05 16:40:32 [ERROR] pg_regress tests failed > 2026-10-05 16:40:32 [ERROR] An error occurred. Exit code: 1 > 2026-10-05 16:40:32 [ERROR] Debug logs: For full logs, run: nix log /nix/store/asj2m6qlrw1h5qgl5s08wygaqya0p5b6-run-check-harness-psql-15.drv error: Cannot build '/nix/store/asj2m6qlrw1h5qgl5s08wygaqya0p5b6-run-check-harness-psql-15.drv'. Reason: builder failed with exit code 1. Output paths: /nix/store/53ifnqhlfprzkhhdwj37r2h8qf9kq1rn-run-check-harness-psql-15