nixbot

builds
1these 3 derivations will be built:2 /nix/store/7zrd36h3d0zfkr39y3dw5yd2zxv6jrzp-start-postgres-server-test.drv3 /nix/store/ad1ma6cv3j6h6b6zgs3l0lz5laiik8l1-postgres-17-check-harness.drv4 /nix/store/iw6c813cxa4g7dylnb16p86adp0gyr3s-run-check-harness-psql-17-slim.drv5error: Cannot build '/nix/store/iw6c813cxa4g7dylnb16p86adp0gyr3s-run-check-harness-psql-17-slim.drv'.6 Reason: builder failed with exit code 1.7 Output paths:8 /nix/store/2lqpi6x6659z8mrb8k8khqdzd46vap1q-run-check-harness-psql-17-slim9 Last 25 log lines:10 > test storage ... FAILED 14 ms11 > test supautils_reserved_roles ... FAILED 7 ms12 > test supautils_restrict_versions ... FAILED 79 ms13 > test supautils_warehouse_writer ... FAILED 10 ms14 > test vault ... FAILED 27 ms15 > test wal2json ... FAILED 13 ms16 > test z_17_ext_interface ... FAILED 111 ms17 > test z_17_intarray_ltree_query ... FAILED 14 ms18 > test z_17_pg_stat_monitor ... FAILED 7 ms19 > test z_17_pgvector ... FAILED 16 ms20 > test z_17_roles ... FAILED 15 ms21 > test z_17_rum ... FAILED 14 ms22 > test z_17_wal_summarize ... FAILED 9 ms23 >24 > ========================25 > 71 of 71 tests failed.26 > ========================27 >28 > The differences that caused some tests to fail can be viewed in the29 > file "/nix/store/2lqpi6x6659z8mrb8k8khqdzd46vap1q-run-check-harness-psql-17-slim/regression_output/regression.diffs". A copy of the test summary that you see30 > above is saved in the file "/nix/store/2lqpi6x6659z8mrb8k8khqdzd46vap1q-run-check-harness-psql-17-slim/regression_output/regression.out".31 >32 > 2026-10-27 10:50:56 [ERROR] pg_regress tests failed33 > 2026-10-27 10:50:56 [ERROR] An error occurred. Exit code: 134 > 2026-10-27 10:50:56 [ERROR] Debug logs:35 For full logs, run:36 nix log /nix/store/iw6c813cxa4g7dylnb16p86adp0gyr3s-run-check-harness-psql-17-slim.drv