these 3 derivations will be built: /nix/store/7zrd36h3d0zfkr39y3dw5yd2zxv6jrzp-start-postgres-server-test.drv /nix/store/ad1ma6cv3j6h6b6zgs3l0lz5laiik8l1-postgres-17-check-harness.drv /nix/store/iw6c813cxa4g7dylnb16p86adp0gyr3s-run-check-harness-psql-17-slim.drv error: Cannot build '/nix/store/iw6c813cxa4g7dylnb16p86adp0gyr3s-run-check-harness-psql-17-slim.drv'. Reason: builder failed with exit code 1. Output paths: /nix/store/2lqpi6x6659z8mrb8k8khqdzd46vap1q-run-check-harness-psql-17-slim Last 25 log lines: > test storage ... FAILED 14 ms > test supautils_reserved_roles ... FAILED 7 ms > test supautils_restrict_versions ... FAILED 79 ms > test supautils_warehouse_writer ... FAILED 10 ms > test vault ... FAILED 27 ms > test wal2json ... FAILED 13 ms > test z_17_ext_interface ... FAILED 111 ms > test z_17_intarray_ltree_query ... FAILED 14 ms > test z_17_pg_stat_monitor ... FAILED 7 ms > test z_17_pgvector ... FAILED 16 ms > test z_17_roles ... FAILED 15 ms > test z_17_rum ... FAILED 14 ms > test z_17_wal_summarize ... FAILED 9 ms > > ======================== > 71 of 71 tests failed. > ======================== > > The differences that caused some tests to fail can be viewed in the > file "/nix/store/2lqpi6x6659z8mrb8k8khqdzd46vap1q-run-check-harness-psql-17-slim/regression_output/regression.diffs". A copy of the test summary that you see > above is saved in the file "/nix/store/2lqpi6x6659z8mrb8k8khqdzd46vap1q-run-check-harness-psql-17-slim/regression_output/regression.out". > > 2026-10-27 10:50:56 [ERROR] pg_regress tests failed > 2026-10-27 10:50:56 [ERROR] An error occurred. Exit code: 1 > 2026-10-27 10:50:56 [ERROR] Debug logs: For full logs, run: nix log /nix/store/iw6c813cxa4g7dylnb16p86adp0gyr3s-run-check-harness-psql-17-slim.drv