nixbot

builds

supabase/postgres build #471 failed

branch develop · PR #2598 · commit 4d8395893c · · took 41m 26s · eval 7m 16s

14 failed
failed attributes
status attribute duration
failed checks.aarch64-linux.psql_15 1m 50s
run-check-harness-psql-15: 74 of 74 tests failed. ======================== The differences that caused some tests to fail can be viewed in the file "/nix/stor …
run-check-harness-psql-15:
 74 of 74 tests failed. 
========================
The differences that caused some tests to fail can be viewed in the
file "/nix/store/j22mgidhg7m3fkbybcj72nizx8zs946d-run-check-harness-psql-15/regression_output/regression.diffs".  A copy of the test summary that you see
above is saved in the file "/nix/store/j22mgidhg7m3fkbybcj72nizx8zs946d-run-check-harness-psql-15/regression_output/regression.out".
2026-10-27 10:49:19 [ERROR] pg_regress tests failed
2026-10-27 10:49:19 [ERROR] An error occurred. Exit code: 1
2026-10-27 10:49:19 [ERROR] Debug logs:
failed checks.aarch64-linux.psql_15_slim 1m 48s
run-check-harness-psql-15-slim: 74 of 74 tests failed. ======================== The differences that caused some tests to fail can be viewed in the file "/nix …
run-check-harness-psql-15-slim:
 74 of 74 tests failed. 
========================
The differences that caused some tests to fail can be viewed in the
file "/nix/store/i2pb8zlrgmk1rhlys2c7p7fys6mc1p7y-run-check-harness-psql-15-slim/regression_output/regression.diffs".  A copy of the test summary that you see
above is saved in the file "/nix/store/i2pb8zlrgmk1rhlys2c7p7fys6mc1p7y-run-check-harness-psql-15-slim/regression_output/regression.out".
2026-10-27 10:47:44 [ERROR] pg_regress tests failed
2026-10-27 10:47:44 [ERROR] An error occurred. Exit code: 1
2026-10-27 10:47:44 [ERROR] Debug logs:
failed checks.aarch64-linux.psql_17 53s
run-check-harness-psql-17: 71 of 71 tests failed. ======================== The differences that caused some tests to fail can be viewed in the file "/nix/stor …
run-check-harness-psql-17:
 71 of 71 tests failed. 
========================
The differences that caused some tests to fail can be viewed in the
file "/nix/store/mbxc61y5x7grg7ws4202lkradjg3dqaq-run-check-harness-psql-17/regression_output/regression.diffs".  A copy of the test summary that you see
above is saved in the file "/nix/store/mbxc61y5x7grg7ws4202lkradjg3dqaq-run-check-harness-psql-17/regression_output/regression.out".
2026-10-27 10:49:02 [ERROR] pg_regress tests failed
2026-10-27 10:49:02 [ERROR] An error occurred. Exit code: 1
2026-10-27 10:49:02 [ERROR] Debug logs:
failed checks.aarch64-linux.psql_17_cli 23s
run-check-harness-psql-17-cli: 38 of 38 tests failed. ======================== The differences that caused some tests to fail can be viewed in the file "/nix/ …
run-check-harness-psql-17-cli:
 38 of 38 tests failed. 
========================
The differences that caused some tests to fail can be viewed in the
file "/nix/store/3r0k3am2cgbx3jrayjv3pk88l82daasd-run-check-harness-psql-17-cli/regression_output/regression.diffs".  A copy of the test summary that you see
above is saved in the file "/nix/store/3r0k3am2cgbx3jrayjv3pk88l82daasd-run-check-harness-psql-17-cli/regression_output/regression.out".
2026-10-27 10:47:53 [ERROR] pg_regress tests failed
2026-10-27 10:47:53 [ERROR] An error occurred. Exit code: 1
2026-10-27 10:47:53 [ERROR] Debug logs:
failed checks.aarch64-linux.psql_17_slim 56s
run-check-harness-psql-17-slim: 71 of 71 tests failed. ======================== The differences that caused some tests to fail can be viewed in the file "/nix …
run-check-harness-psql-17-slim:
 71 of 71 tests failed. 
========================
The differences that caused some tests to fail can be viewed in the
file "/nix/store/y02ydgf62smxz5q5r722jnnjl5icsnz9-run-check-harness-psql-17-slim/regression_output/regression.diffs".  A copy of the test summary that you see
above is saved in the file "/nix/store/y02ydgf62smxz5q5r722jnnjl5icsnz9-run-check-harness-psql-17-slim/regression_output/regression.out".
2026-10-27 10:46:52 [ERROR] pg_regress tests failed
2026-10-27 10:46:52 [ERROR] An error occurred. Exit code: 1
2026-10-27 10:46:52 [ERROR] Debug logs:
failed checks.aarch64-linux.psql_orioledb-17 52s
run-check-harness-psql-orioledb-17: 68 of 68 tests failed. ======================== The differences that caused some tests to fail can be viewed in the file " …
run-check-harness-psql-orioledb-17:
 68 of 68 tests failed. 
========================
The differences that caused some tests to fail can be viewed in the
file "/nix/store/rs7d8b2iz1xlq495lj97p5pvgm4a38zc-run-check-harness-psql-orioledb-17/regression_output/regression.diffs".  A copy of the test summary that you see
above is saved in the file "/nix/store/rs7d8b2iz1xlq495lj97p5pvgm4a38zc-run-check-harness-psql-orioledb-17/regression_output/regression.out".
2026-10-27 10:50:34 [ERROR] pg_regress tests failed
2026-10-27 10:50:34 [ERROR] An error occurred. Exit code: 1
2026-10-27 10:50:34 [ERROR] Debug logs:
failed checks.aarch64-linux.psql_orioledb-17_slim 57s
run-check-harness-psql-orioledb-17-slim: 68 of 68 tests failed. ======================== The differences that caused some tests to fail can be viewed in the f …
run-check-harness-psql-orioledb-17-slim:
 68 of 68 tests failed. 
========================
The differences that caused some tests to fail can be viewed in the
file "/nix/store/q1h8dywi6iwzx3dr3bxk9f0qs6saqrb4-run-check-harness-psql-orioledb-17-slim/regression_output/regression.diffs".  A copy of the test summary that you see
above is saved in the file "/nix/store/q1h8dywi6iwzx3dr3bxk9f0qs6saqrb4-run-check-harness-psql-orioledb-17-slim/regression_output/regression.out".
2026-10-27 10:46:54 [ERROR] pg_regress tests failed
2026-10-27 10:46:54 [ERROR] An error occurred. Exit code: 1
2026-10-27 10:46:54 [ERROR] Debug logs:
failed checks.x86_64-linux.psql_15 1m 4s
run-check-harness-psql-15: 74 of 74 tests failed. ======================== The differences that caused some tests to fail can be viewed in the file "/nix/stor …
run-check-harness-psql-15:
 74 of 74 tests failed. 
========================
The differences that caused some tests to fail can be viewed in the
file "/nix/store/4gjmfdp96gv57iyi47vbi0yj00rzjxvy-run-check-harness-psql-15/regression_output/regression.diffs".  A copy of the test summary that you see
above is saved in the file "/nix/store/4gjmfdp96gv57iyi47vbi0yj00rzjxvy-run-check-harness-psql-15/regression_output/regression.out".
2026-10-27 10:51:38 [ERROR] pg_regress tests failed
2026-10-27 10:51:38 [ERROR] An error occurred. Exit code: 1
2026-10-27 10:51:38 [ERROR] Debug logs:
failed checks.x86_64-linux.psql_15_slim 1m 4s
run-check-harness-psql-15-slim: 74 of 74 tests failed. ======================== The differences that caused some tests to fail can be viewed in the file "/nix …
run-check-harness-psql-15-slim:
 74 of 74 tests failed. 
========================
The differences that caused some tests to fail can be viewed in the
file "/nix/store/f90xa83y5d02gr1yb92ca0i7dvd8mv5l-run-check-harness-psql-15-slim/regression_output/regression.diffs".  A copy of the test summary that you see
above is saved in the file "/nix/store/f90xa83y5d02gr1yb92ca0i7dvd8mv5l-run-check-harness-psql-15-slim/regression_output/regression.out".
2026-10-27 10:51:50 [ERROR] pg_regress tests failed
2026-10-27 10:51:50 [ERROR] An error occurred. Exit code: 1
2026-10-27 10:51:50 [ERROR] Debug logs:
failed checks.x86_64-linux.psql_17 36s
run-check-harness-psql-17: 71 of 71 tests failed. ======================== The differences that caused some tests to fail can be viewed in the file "/nix/stor …
run-check-harness-psql-17:
 71 of 71 tests failed. 
========================
The differences that caused some tests to fail can be viewed in the
file "/nix/store/94hy6yxwv5v7gi82f3mycr0sbsykjgqb-run-check-harness-psql-17/regression_output/regression.diffs".  A copy of the test summary that you see
above is saved in the file "/nix/store/94hy6yxwv5v7gi82f3mycr0sbsykjgqb-run-check-harness-psql-17/regression_output/regression.out".
2026-10-27 10:51:08 [ERROR] pg_regress tests failed
2026-10-27 10:51:08 [ERROR] An error occurred. Exit code: 1
2026-10-27 10:51:08 [ERROR] Debug logs:
failed checks.x86_64-linux.psql_17_cli 17s
run-check-harness-psql-17-cli: 38 of 38 tests failed. ======================== The differences that caused some tests to fail can be viewed in the file "/nix/ …
run-check-harness-psql-17-cli:
 38 of 38 tests failed. 
========================
The differences that caused some tests to fail can be viewed in the
file "/nix/store/2jbyjy0f4vrgbccp7ddqxy3yvmgwq3sl-run-check-harness-psql-17-cli/regression_output/regression.diffs".  A copy of the test summary that you see
above is saved in the file "/nix/store/2jbyjy0f4vrgbccp7ddqxy3yvmgwq3sl-run-check-harness-psql-17-cli/regression_output/regression.out".
2026-10-27 10:50:32 [ERROR] pg_regress tests failed
2026-10-27 10:50:32 [ERROR] An error occurred. Exit code: 1
2026-10-27 10:50:32 [ERROR] Debug logs:
failed checks.x86_64-linux.psql_17_slim 37s
run-check-harness-psql-17-slim: 71 of 71 tests failed. ======================== The differences that caused some tests to fail can be viewed in the file "/nix …
run-check-harness-psql-17-slim:
 71 of 71 tests failed. 
========================
The differences that caused some tests to fail can be viewed in the
file "/nix/store/2lqpi6x6659z8mrb8k8khqdzd46vap1q-run-check-harness-psql-17-slim/regression_output/regression.diffs".  A copy of the test summary that you see
above is saved in the file "/nix/store/2lqpi6x6659z8mrb8k8khqdzd46vap1q-run-check-harness-psql-17-slim/regression_output/regression.out".
2026-10-27 10:50:56 [ERROR] pg_regress tests failed
2026-10-27 10:50:56 [ERROR] An error occurred. Exit code: 1
2026-10-27 10:50:56 [ERROR] Debug logs:
failed checks.x86_64-linux.psql_orioledb-17 37s
run-check-harness-psql-orioledb-17: 68 of 68 tests failed. ======================== The differences that caused some tests to fail can be viewed in the file " …
run-check-harness-psql-orioledb-17:
 68 of 68 tests failed. 
========================
The differences that caused some tests to fail can be viewed in the
file "/nix/store/5pq0idrhv7yflas7lwzargsibnwwnqwy-run-check-harness-psql-orioledb-17/regression_output/regression.diffs".  A copy of the test summary that you see
above is saved in the file "/nix/store/5pq0idrhv7yflas7lwzargsibnwwnqwy-run-check-harness-psql-orioledb-17/regression_output/regression.out".
2026-10-27 10:51:33 [ERROR] pg_regress tests failed
2026-10-27 10:51:33 [ERROR] An error occurred. Exit code: 1
2026-10-27 10:51:33 [ERROR] Debug logs:
failed checks.x86_64-linux.psql_orioledb-17_slim 36s
run-check-harness-psql-orioledb-17-slim: 68 of 68 tests failed. ======================== The differences that caused some tests to fail can be viewed in the f …
run-check-harness-psql-orioledb-17-slim:
 68 of 68 tests failed. 
========================
The differences that caused some tests to fail can be viewed in the
file "/nix/store/ykwb2hwh4gsmr96z05f8zxam49d619my-run-check-harness-psql-orioledb-17-slim/regression_output/regression.diffs".  A copy of the test summary that you see
above is saved in the file "/nix/store/ykwb2hwh4gsmr96z05f8zxam49d619my-run-check-harness-psql-orioledb-17-slim/regression_output/regression.out".
2026-10-27 10:50:58 [ERROR] pg_regress tests failed
2026-10-27 10:50:58 [ERROR] An error occurred. Exit code: 1
2026-10-27 10:50:58 [ERROR] Debug logs:
70 succeeded
succeeded attributes
status attribute duration
loading…
52 already built
skipped attributes
status attribute duration
loading…