setup
checks.x86_64-linux.psql_17_cli
· build #471
· raw
1these 3 derivations will be built:2 /nix/store/9dkpgnfg40v052g5plg4hvq092d9y75q-start-postgres-server-test.drv3 /nix/store/249g2p5b8r8n2gqlljrwxb73d3d2ipa1-postgres-17-check-harness.drv4 /nix/store/dmgh782fzsxjxch0c2irldzq1rxlrw00-run-check-harness-psql-17-cli.drv5error: Cannot build '/nix/store/dmgh782fzsxjxch0c2irldzq1rxlrw00-run-check-harness-psql-17-cli.drv'.6 Reason: builder failed with exit code 1.7 Output paths:8 /nix/store/2jbyjy0f4vrgbccp7ddqxy3yvmgwq3sl-run-check-harness-psql-17-cli9 Last 25 log lines:10 > test pgaudit ... FAILED 10 ms11 > test pgbouncer ... FAILED 17 ms12 > test pgcrypto_cipher_matrix ... FAILED 21 ms13 > test pgsodium ... FAILED 8 ms14 > test realtime ... FAILED 6 ms15 > test replica_identity_upsert ... FAILED 12 ms16 > test storage ... FAILED 12 ms17 > test supautils_reserved_roles ... FAILED 8 ms18 > test supautils_warehouse_writer ... FAILED 11 ms19 > test vault ... FAILED 23 ms20 > test wal2json ... FAILED 14 ms21 > test z_17_intarray_ltree_query ... FAILED 42 ms22 > test z_17_wal_summarize ... FAILED 8 ms23 >24 > ========================25 > 38 of 38 tests failed.26 > ========================27 >28 > The differences that caused some tests to fail can be viewed in the29 > file "/nix/store/2jbyjy0f4vrgbccp7ddqxy3yvmgwq3sl-run-check-harness-psql-17-cli/regression_output/regression.diffs". A copy of the test summary that you see30 > above is saved in the file "/nix/store/2jbyjy0f4vrgbccp7ddqxy3yvmgwq3sl-run-check-harness-psql-17-cli/regression_output/regression.out".31 >32 > 2026-10-27 10:50:32 [ERROR] pg_regress tests failed33 > 2026-10-27 10:50:32 [ERROR] An error occurred. Exit code: 134 > 2026-10-27 10:50:32 [ERROR] Debug logs:35 For full logs, run:36 nix log /nix/store/dmgh782fzsxjxch0c2irldzq1rxlrw00-run-check-harness-psql-17-cli.drv