these 3 derivations will be built: /nix/store/9dkpgnfg40v052g5plg4hvq092d9y75q-start-postgres-server-test.drv /nix/store/249g2p5b8r8n2gqlljrwxb73d3d2ipa1-postgres-17-check-harness.drv /nix/store/dmgh782fzsxjxch0c2irldzq1rxlrw00-run-check-harness-psql-17-cli.drv error: Cannot build '/nix/store/dmgh782fzsxjxch0c2irldzq1rxlrw00-run-check-harness-psql-17-cli.drv'. Reason: builder failed with exit code 1. Output paths: /nix/store/2jbyjy0f4vrgbccp7ddqxy3yvmgwq3sl-run-check-harness-psql-17-cli Last 25 log lines: > test pgaudit ... FAILED 10 ms > test pgbouncer ... FAILED 17 ms > test pgcrypto_cipher_matrix ... FAILED 21 ms > test pgsodium ... FAILED 8 ms > test realtime ... FAILED 6 ms > test replica_identity_upsert ... FAILED 12 ms > test storage ... FAILED 12 ms > test supautils_reserved_roles ... FAILED 8 ms > test supautils_warehouse_writer ... FAILED 11 ms > test vault ... FAILED 23 ms > test wal2json ... FAILED 14 ms > test z_17_intarray_ltree_query ... FAILED 42 ms > test z_17_wal_summarize ... FAILED 8 ms > > ======================== > 38 of 38 tests failed. > ======================== > > The differences that caused some tests to fail can be viewed in the > file "/nix/store/2jbyjy0f4vrgbccp7ddqxy3yvmgwq3sl-run-check-harness-psql-17-cli/regression_output/regression.diffs". A copy of the test summary that you see > above is saved in the file "/nix/store/2jbyjy0f4vrgbccp7ddqxy3yvmgwq3sl-run-check-harness-psql-17-cli/regression_output/regression.out". > > 2026-10-27 10:50:32 [ERROR] pg_regress tests failed > 2026-10-27 10:50:32 [ERROR] An error occurred. Exit code: 1 > 2026-10-27 10:50:32 [ERROR] Debug logs: For full logs, run: nix log /nix/store/dmgh782fzsxjxch0c2irldzq1rxlrw00-run-check-harness-psql-17-cli.drv