setup
checks.x86_64-linux.psql_17
· build #471
· raw
1these 3 derivations will be built:2 /nix/store/3yrbiwb8rwbc63p4hdr0vbk6qda99klw-start-postgres-server-test.drv3 /nix/store/6bl4frzip6882n4lhjb3s638y92ir00q-postgres-17-check-harness.drv4 /nix/store/qrzrxgzdarj6jvjyb8zjvkv6k2m7ymcm-run-check-harness-psql-17.drv5error: Cannot build '/nix/store/qrzrxgzdarj6jvjyb8zjvkv6k2m7ymcm-run-check-harness-psql-17.drv'.6 Reason: builder failed with exit code 1.7 Output paths:8 /nix/store/94hy6yxwv5v7gi82f3mycr0sbsykjgqb-run-check-harness-psql-179 Last 25 log lines:10 > test storage ... FAILED 15 ms11 > test supautils_reserved_roles ... FAILED 8 ms12 > test supautils_restrict_versions ... FAILED 80 ms13 > test supautils_warehouse_writer ... FAILED 10 ms14 > test vault ... FAILED 25 ms15 > test wal2json ... FAILED 13 ms16 > test z_17_ext_interface ... FAILED 118 ms17 > test z_17_intarray_ltree_query ... FAILED 14 ms18 > test z_17_pg_stat_monitor ... FAILED 7 ms19 > test z_17_pgvector ... FAILED 14 ms20 > test z_17_roles ... FAILED 16 ms21 > test z_17_rum ... FAILED 14 ms22 > test z_17_wal_summarize ... FAILED 8 ms23 >24 > ========================25 > 71 of 71 tests failed.26 > ========================27 >28 > The differences that caused some tests to fail can be viewed in the29 > file "/nix/store/94hy6yxwv5v7gi82f3mycr0sbsykjgqb-run-check-harness-psql-17/regression_output/regression.diffs". A copy of the test summary that you see30 > above is saved in the file "/nix/store/94hy6yxwv5v7gi82f3mycr0sbsykjgqb-run-check-harness-psql-17/regression_output/regression.out".31 >32 > 2026-10-27 10:51:08 [ERROR] pg_regress tests failed33 > 2026-10-27 10:51:08 [ERROR] An error occurred. Exit code: 134 > 2026-10-27 10:51:08 [ERROR] Debug logs:35 For full logs, run:36 nix log /nix/store/qrzrxgzdarj6jvjyb8zjvkv6k2m7ymcm-run-check-harness-psql-17.drv