these 3 derivations will be built: /nix/store/3yrbiwb8rwbc63p4hdr0vbk6qda99klw-start-postgres-server-test.drv /nix/store/6bl4frzip6882n4lhjb3s638y92ir00q-postgres-17-check-harness.drv /nix/store/qrzrxgzdarj6jvjyb8zjvkv6k2m7ymcm-run-check-harness-psql-17.drv error: Cannot build '/nix/store/qrzrxgzdarj6jvjyb8zjvkv6k2m7ymcm-run-check-harness-psql-17.drv'. Reason: builder failed with exit code 1. Output paths: /nix/store/94hy6yxwv5v7gi82f3mycr0sbsykjgqb-run-check-harness-psql-17 Last 25 log lines: > test storage ... FAILED 15 ms > test supautils_reserved_roles ... FAILED 8 ms > test supautils_restrict_versions ... FAILED 80 ms > test supautils_warehouse_writer ... FAILED 10 ms > test vault ... FAILED 25 ms > test wal2json ... FAILED 13 ms > test z_17_ext_interface ... FAILED 118 ms > test z_17_intarray_ltree_query ... FAILED 14 ms > test z_17_pg_stat_monitor ... FAILED 7 ms > test z_17_pgvector ... FAILED 14 ms > test z_17_roles ... FAILED 16 ms > test z_17_rum ... FAILED 14 ms > test z_17_wal_summarize ... FAILED 8 ms > > ======================== > 71 of 71 tests failed. > ======================== > > The differences that caused some tests to fail can be viewed in the > file "/nix/store/94hy6yxwv5v7gi82f3mycr0sbsykjgqb-run-check-harness-psql-17/regression_output/regression.diffs". A copy of the test summary that you see > above is saved in the file "/nix/store/94hy6yxwv5v7gi82f3mycr0sbsykjgqb-run-check-harness-psql-17/regression_output/regression.out". > > 2026-10-27 10:51:08 [ERROR] pg_regress tests failed > 2026-10-27 10:51:08 [ERROR] An error occurred. Exit code: 1 > 2026-10-27 10:51:08 [ERROR] Debug logs: For full logs, run: nix log /nix/store/qrzrxgzdarj6jvjyb8zjvkv6k2m7ymcm-run-check-harness-psql-17.drv