setup
checks.x86_64-linux.psql_15
· build #471
· raw
1these 3 derivations will be built:2 /nix/store/pwbg7a57x9y2myjc1irvbxv90svx5xc8-start-postgres-server-test.drv3 /nix/store/767avb56s0i9hjfk3nbqbr0szbpjqjg1-postgres-15-check-harness.drv4 /nix/store/ha1qf3shnnygg3kg8fcb4xx72qbx4a24-run-check-harness-psql-15.drv5error: Cannot build '/nix/store/ha1qf3shnnygg3kg8fcb4xx72qbx4a24-run-check-harness-psql-15.drv'.6 Reason: builder failed with exit code 1.7 Output paths:8 /nix/store/4gjmfdp96gv57iyi47vbi0yj00rzjxvy-run-check-harness-psql-159 Last 25 log lines:10 > test supautils_warehouse_writer ... FAILED 11 ms11 > test vault ... FAILED 28 ms12 > test wal2json ... FAILED 17 ms13 > test z_15_ext_interface ... FAILED 630 ms14 > test z_15_intarray_ltree_query ... FAILED 12 ms15 > test z_15_pg_stat_monitor ... FAILED 11 ms16 > test z_15_pgjwt ... FAILED 19 ms17 > test z_15_pgvector ... FAILED 36 ms18 > test z_15_plv8 ... FAILED 48 ms19 > test z_15_roles ... FAILED 19 ms20 > test z_15_rum ... FAILED 18 ms21 > test z_15_timescale ... FAILED 21 ms22 > test z_15_unhype_timescale_to_partman ... FAILED 11627 ms23 >24 > ========================25 > 74 of 74 tests failed.26 > ========================27 >28 > The differences that caused some tests to fail can be viewed in the29 > file "/nix/store/4gjmfdp96gv57iyi47vbi0yj00rzjxvy-run-check-harness-psql-15/regression_output/regression.diffs". A copy of the test summary that you see30 > above is saved in the file "/nix/store/4gjmfdp96gv57iyi47vbi0yj00rzjxvy-run-check-harness-psql-15/regression_output/regression.out".31 >32 > 2026-10-27 10:51:38 [ERROR] pg_regress tests failed33 > 2026-10-27 10:51:38 [ERROR] An error occurred. Exit code: 134 > 2026-10-27 10:51:38 [ERROR] Debug logs:35 For full logs, run:36 nix log /nix/store/ha1qf3shnnygg3kg8fcb4xx72qbx4a24-run-check-harness-psql-15.drv