these 3 derivations will be built: /nix/store/pwbg7a57x9y2myjc1irvbxv90svx5xc8-start-postgres-server-test.drv /nix/store/767avb56s0i9hjfk3nbqbr0szbpjqjg1-postgres-15-check-harness.drv /nix/store/ha1qf3shnnygg3kg8fcb4xx72qbx4a24-run-check-harness-psql-15.drv error: Cannot build '/nix/store/ha1qf3shnnygg3kg8fcb4xx72qbx4a24-run-check-harness-psql-15.drv'. Reason: builder failed with exit code 1. Output paths: /nix/store/4gjmfdp96gv57iyi47vbi0yj00rzjxvy-run-check-harness-psql-15 Last 25 log lines: > test supautils_warehouse_writer ... FAILED 11 ms > test vault ... FAILED 28 ms > test wal2json ... FAILED 17 ms > test z_15_ext_interface ... FAILED 630 ms > test z_15_intarray_ltree_query ... FAILED 12 ms > test z_15_pg_stat_monitor ... FAILED 11 ms > test z_15_pgjwt ... FAILED 19 ms > test z_15_pgvector ... FAILED 36 ms > test z_15_plv8 ... FAILED 48 ms > test z_15_roles ... FAILED 19 ms > test z_15_rum ... FAILED 18 ms > test z_15_timescale ... FAILED 21 ms > test z_15_unhype_timescale_to_partman ... FAILED 11627 ms > > ======================== > 74 of 74 tests failed. > ======================== > > The differences that caused some tests to fail can be viewed in the > file "/nix/store/4gjmfdp96gv57iyi47vbi0yj00rzjxvy-run-check-harness-psql-15/regression_output/regression.diffs". A copy of the test summary that you see > above is saved in the file "/nix/store/4gjmfdp96gv57iyi47vbi0yj00rzjxvy-run-check-harness-psql-15/regression_output/regression.out". > > 2026-10-27 10:51:38 [ERROR] pg_regress tests failed > 2026-10-27 10:51:38 [ERROR] An error occurred. Exit code: 1 > 2026-10-27 10:51:38 [ERROR] Debug logs: For full logs, run: nix log /nix/store/ha1qf3shnnygg3kg8fcb4xx72qbx4a24-run-check-harness-psql-15.drv