nixbot

builds
1these 3 derivations will be built:2 /nix/store/jivj5brfma159lsijvvkv97vg8pikvyc-start-postgres-server-test.drv3 /nix/store/j80zbzb45a31csdx5jb5ax63vj28xpqs-postgres-15-check-harness.drv4 /nix/store/rmnhfcxcp76sp83ynm4jdrpcg6w05b36-run-check-harness-psql-15.drv5error: Cannot build '/nix/store/rmnhfcxcp76sp83ynm4jdrpcg6w05b36-run-check-harness-psql-15.drv'.6 Reason: builder failed with exit code 1.7 Output paths:8 /nix/store/734nmwcbdh4lg969s9inv7lqjn5b4kw5-run-check-harness-psql-159 Last 25 log lines:10 > test supautils_restrict_versions ... ok 80 ms11 > test vault ... ok 28 ms12 > test wal2json ... ok 15 ms13 > test z_15_ext_interface ... FAILED 612 ms14 > test z_15_intarray_ltree_query ... ok 12 ms15 > test z_15_pg_stat_monitor ... ok 12 ms16 > test z_15_pgjwt ... ok 18 ms17 > test z_15_pgvector ... ok 31 ms18 > test z_15_plv8 ... ok 47 ms19 > test z_15_roles ... ok 16 ms20 > test z_15_rum ... ok 17 ms21 > test z_15_timescale ... ok 24 ms22 > test z_15_unhype_timescale_to_partman ... ok 12138 ms23 >24 > =======================25 > 4 of 73 tests failed.26 > =======================27 >28 > The differences that caused some tests to fail can be viewed in the29 > file "/nix/store/734nmwcbdh4lg969s9inv7lqjn5b4kw5-run-check-harness-psql-15/regression_output/regression.diffs". A copy of the test summary that you see30 > above is saved in the file "/nix/store/734nmwcbdh4lg969s9inv7lqjn5b4kw5-run-check-harness-psql-15/regression_output/regression.out".31 >32 > 2026-10-26 12:44:48 [ERROR] pg_regress tests failed33 > 2026-10-26 12:44:48 [ERROR] An error occurred. Exit code: 134 > 2026-10-26 12:44:48 [ERROR] Debug logs:35 For full logs, run:36 nix log /nix/store/rmnhfcxcp76sp83ynm4jdrpcg6w05b36-run-check-harness-psql-15.drv