these 3 derivations will be built: /nix/store/jivj5brfma159lsijvvkv97vg8pikvyc-start-postgres-server-test.drv /nix/store/j80zbzb45a31csdx5jb5ax63vj28xpqs-postgres-15-check-harness.drv /nix/store/rmnhfcxcp76sp83ynm4jdrpcg6w05b36-run-check-harness-psql-15.drv error: Cannot build '/nix/store/rmnhfcxcp76sp83ynm4jdrpcg6w05b36-run-check-harness-psql-15.drv'. Reason: builder failed with exit code 1. Output paths: /nix/store/734nmwcbdh4lg969s9inv7lqjn5b4kw5-run-check-harness-psql-15 Last 25 log lines: > test supautils_restrict_versions ... ok 80 ms > test vault ... ok 28 ms > test wal2json ... ok 15 ms > test z_15_ext_interface ... FAILED 612 ms > test z_15_intarray_ltree_query ... ok 12 ms > test z_15_pg_stat_monitor ... ok 12 ms > test z_15_pgjwt ... ok 18 ms > test z_15_pgvector ... ok 31 ms > test z_15_plv8 ... ok 47 ms > test z_15_roles ... ok 16 ms > test z_15_rum ... ok 17 ms > test z_15_timescale ... ok 24 ms > test z_15_unhype_timescale_to_partman ... ok 12138 ms > > ======================= > 4 of 73 tests failed. > ======================= > > The differences that caused some tests to fail can be viewed in the > file "/nix/store/734nmwcbdh4lg969s9inv7lqjn5b4kw5-run-check-harness-psql-15/regression_output/regression.diffs". A copy of the test summary that you see > above is saved in the file "/nix/store/734nmwcbdh4lg969s9inv7lqjn5b4kw5-run-check-harness-psql-15/regression_output/regression.out". > > 2026-10-26 12:44:48 [ERROR] pg_regress tests failed > 2026-10-26 12:44:48 [ERROR] An error occurred. Exit code: 1 > 2026-10-26 12:44:48 [ERROR] Debug logs: For full logs, run: nix log /nix/store/rmnhfcxcp76sp83ynm4jdrpcg6w05b36-run-check-harness-psql-15.drv