nixbot

builds

supabase/postgres build #462 failed

branch develop · PR #2595 · commit 45dc374ec7 · · took 48m 13s · eval 9m 12s

13 failed
failed attributes
status attribute duration
failed checks.aarch64-linux.ext-pg-upgrade-start-guard 29m 33s
vm-test-run-pg-upgrade-start-guard: !!! RequestedAssertionFailed: command `systemd-run --unit=fake-initiate --collect --pipe --wait /nix/store/v7833w1jm7rl64gns …
vm-test-run-pg-upgrade-start-guard:
!!! RequestedAssertionFailed: command `systemd-run --unit=fake-initiate --collect --pipe --wait /nix/store/v7833w1jm7rl64gns1izka6rd90a333r-drive/bin/drive upgrade` failed (exit code 1)
cleanup
kill machine (pid 9)
qemu-system-aarch64: terminating on signal 15 from pid 6 (/nix/store/y88crn50yx35fiiwcjx6xqwi6ahk7mlq-python3-3.13.11/bin/python3.13)
vde_switch: EOF data port: Interrupted system call
kill vlan (pid 7)
(finished: cleanup, in 0.00 seconds)
vde_switch: Caught signal 15, cleaning up and exiting
failed checks.aarch64-linux.psql_15 2m 9s
run-check-harness-psql-15: 4 of 73 tests failed. ======================= The differences that caused some tests to fail can be viewed in the file "/nix/store/ …
run-check-harness-psql-15:
 4 of 73 tests failed. 
=======================
The differences that caused some tests to fail can be viewed in the
file "/nix/store/ibyjcl4f7ab1s36xcidg7vd25ilw2rvb-run-check-harness-psql-15/regression_output/regression.diffs".  A copy of the test summary that you see
above is saved in the file "/nix/store/ibyjcl4f7ab1s36xcidg7vd25ilw2rvb-run-check-harness-psql-15/regression_output/regression.out".
2026-10-26 12:40:32 [ERROR] pg_regress tests failed
2026-10-26 12:40:33 [ERROR] An error occurred. Exit code: 1
2026-10-26 12:40:33 [ERROR] Debug logs:
failed checks.aarch64-linux.psql_15_slim 1m 49s
run-check-harness-psql-15-slim: 4 of 73 tests failed. ======================= The differences that caused some tests to fail can be viewed in the file "/nix/s …
run-check-harness-psql-15-slim:
 4 of 73 tests failed. 
=======================
The differences that caused some tests to fail can be viewed in the
file "/nix/store/xnjhp1gsr8liwfh3dyz3j0cms8lbn5ai-run-check-harness-psql-15-slim/regression_output/regression.diffs".  A copy of the test summary that you see
above is saved in the file "/nix/store/xnjhp1gsr8liwfh3dyz3j0cms8lbn5ai-run-check-harness-psql-15-slim/regression_output/regression.out".
2026-10-26 12:42:22 [ERROR] pg_regress tests failed
2026-10-26 12:42:23 [ERROR] An error occurred. Exit code: 1
2026-10-26 12:42:23 [ERROR] Debug logs:
failed checks.aarch64-linux.psql_17 1m 15s
run-check-harness-psql-17: 4 of 70 tests failed. ======================= The differences that caused some tests to fail can be viewed in the file "/nix/store/ …
run-check-harness-psql-17:
 4 of 70 tests failed. 
=======================
The differences that caused some tests to fail can be viewed in the
file "/nix/store/y1y9imhhy5j3l1853ysfh41g85b641pw-run-check-harness-psql-17/regression_output/regression.diffs".  A copy of the test summary that you see
above is saved in the file "/nix/store/y1y9imhhy5j3l1853ysfh41g85b641pw-run-check-harness-psql-17/regression_output/regression.out".
2026-10-26 12:39:39 [ERROR] pg_regress tests failed
2026-10-26 12:39:40 [ERROR] An error occurred. Exit code: 1
2026-10-26 12:39:40 [ERROR] Debug logs:
failed checks.aarch64-linux.psql_17_slim 1m 16s
run-check-harness-psql-17-slim: 4 of 70 tests failed. ======================= The differences that caused some tests to fail can be viewed in the file "/nix/s …
run-check-harness-psql-17-slim:
 4 of 70 tests failed. 
=======================
The differences that caused some tests to fail can be viewed in the
file "/nix/store/lzlw640mhmh9in45sl8idakvg6by90ym-run-check-harness-psql-17-slim/regression_output/regression.diffs".  A copy of the test summary that you see
above is saved in the file "/nix/store/lzlw640mhmh9in45sl8idakvg6by90ym-run-check-harness-psql-17-slim/regression_output/regression.out".
2026-10-26 12:39:39 [ERROR] pg_regress tests failed
2026-10-26 12:39:41 [ERROR] An error occurred. Exit code: 1
2026-10-26 12:39:41 [ERROR] Debug logs:
failed checks.aarch64-linux.psql_orioledb-17 1m 16s
run-check-harness-psql-orioledb-17: 4 of 67 tests failed. ======================= The differences that caused some tests to fail can be viewed in the file "/n …
run-check-harness-psql-orioledb-17:
 4 of 67 tests failed. 
=======================
The differences that caused some tests to fail can be viewed in the
file "/nix/store/8s7nqcyf39pjdyrj6f39vq2ldmavkjxz-run-check-harness-psql-orioledb-17/regression_output/regression.diffs".  A copy of the test summary that you see
above is saved in the file "/nix/store/8s7nqcyf39pjdyrj6f39vq2ldmavkjxz-run-check-harness-psql-orioledb-17/regression_output/regression.out".
2026-10-26 12:39:39 [ERROR] pg_regress tests failed
2026-10-26 12:39:40 [ERROR] An error occurred. Exit code: 1
2026-10-26 12:39:40 [ERROR] Debug logs:
failed checks.aarch64-linux.psql_orioledb-17_slim 1m 18s
run-check-harness-psql-orioledb-17-slim: 4 of 67 tests failed. ======================= The differences that caused some tests to fail can be viewed in the fil …
run-check-harness-psql-orioledb-17-slim:
 4 of 67 tests failed. 
=======================
The differences that caused some tests to fail can be viewed in the
file "/nix/store/sa5yiy3hppdy59jg8v8a9qwxgarhlhh1-run-check-harness-psql-orioledb-17-slim/regression_output/regression.diffs".  A copy of the test summary that you see
above is saved in the file "/nix/store/sa5yiy3hppdy59jg8v8a9qwxgarhlhh1-run-check-harness-psql-orioledb-17-slim/regression_output/regression.out".
2026-10-26 12:39:41 [ERROR] pg_regress tests failed
2026-10-26 12:39:42 [ERROR] An error occurred. Exit code: 1
2026-10-26 12:39:42 [ERROR] Debug logs:
failed checks.x86_64-linux.psql_15 1m 3s
run-check-harness-psql-15: 4 of 73 tests failed. ======================= The differences that caused some tests to fail can be viewed in the file "/nix/store/ …
run-check-harness-psql-15:
 4 of 73 tests failed. 
=======================
The differences that caused some tests to fail can be viewed in the
file "/nix/store/734nmwcbdh4lg969s9inv7lqjn5b4kw5-run-check-harness-psql-15/regression_output/regression.diffs".  A copy of the test summary that you see
above is saved in the file "/nix/store/734nmwcbdh4lg969s9inv7lqjn5b4kw5-run-check-harness-psql-15/regression_output/regression.out".
2026-10-26 12:44:48 [ERROR] pg_regress tests failed
2026-10-26 12:44:48 [ERROR] An error occurred. Exit code: 1
2026-10-26 12:44:48 [ERROR] Debug logs:
failed checks.x86_64-linux.psql_15_slim 1m 4s
run-check-harness-psql-15-slim: 4 of 73 tests failed. ======================= The differences that caused some tests to fail can be viewed in the file "/nix/s …
run-check-harness-psql-15-slim:
 4 of 73 tests failed. 
=======================
The differences that caused some tests to fail can be viewed in the
file "/nix/store/g8324h7mw4ih3mzmarmdx4a6756krjni-run-check-harness-psql-15-slim/regression_output/regression.diffs".  A copy of the test summary that you see
above is saved in the file "/nix/store/g8324h7mw4ih3mzmarmdx4a6756krjni-run-check-harness-psql-15-slim/regression_output/regression.out".
2026-10-26 12:45:09 [ERROR] pg_regress tests failed
2026-10-26 12:45:09 [ERROR] An error occurred. Exit code: 1
2026-10-26 12:45:09 [ERROR] Debug logs:
failed checks.x86_64-linux.psql_17 36s
run-check-harness-psql-17: 4 of 70 tests failed. ======================= The differences that caused some tests to fail can be viewed in the file "/nix/store/ …
run-check-harness-psql-17:
 4 of 70 tests failed. 
=======================
The differences that caused some tests to fail can be viewed in the
file "/nix/store/y6qiv906ba2c1kjw8sqn9mgcnpvaghxi-run-check-harness-psql-17/regression_output/regression.diffs".  A copy of the test summary that you see
above is saved in the file "/nix/store/y6qiv906ba2c1kjw8sqn9mgcnpvaghxi-run-check-harness-psql-17/regression_output/regression.out".
2026-10-26 12:46:32 [ERROR] pg_regress tests failed
2026-10-26 12:46:32 [ERROR] An error occurred. Exit code: 1
2026-10-26 12:46:32 [ERROR] Debug logs:
failed checks.x86_64-linux.psql_17_slim 36s
run-check-harness-psql-17-slim: 4 of 70 tests failed. ======================= The differences that caused some tests to fail can be viewed in the file "/nix/s …
run-check-harness-psql-17-slim:
 4 of 70 tests failed. 
=======================
The differences that caused some tests to fail can be viewed in the
file "/nix/store/b2k19faj8z6zpn3wa10a2hk7yn29dijl-run-check-harness-psql-17-slim/regression_output/regression.diffs".  A copy of the test summary that you see
above is saved in the file "/nix/store/b2k19faj8z6zpn3wa10a2hk7yn29dijl-run-check-harness-psql-17-slim/regression_output/regression.out".
2026-10-26 12:46:58 [ERROR] pg_regress tests failed
2026-10-26 12:46:59 [ERROR] An error occurred. Exit code: 1
2026-10-26 12:46:59 [ERROR] Debug logs:
failed checks.x86_64-linux.psql_orioledb-17 36s
run-check-harness-psql-orioledb-17: 4 of 67 tests failed. ======================= The differences that caused some tests to fail can be viewed in the file "/n …
run-check-harness-psql-orioledb-17:
 4 of 67 tests failed. 
=======================
The differences that caused some tests to fail can be viewed in the
file "/nix/store/y2laqbyrrdcbmh7s6nafykch1sc1zqix-run-check-harness-psql-orioledb-17/regression_output/regression.diffs".  A copy of the test summary that you see
above is saved in the file "/nix/store/y2laqbyrrdcbmh7s6nafykch1sc1zqix-run-check-harness-psql-orioledb-17/regression_output/regression.out".
2026-10-26 12:46:29 [ERROR] pg_regress tests failed
2026-10-26 12:46:30 [ERROR] An error occurred. Exit code: 1
2026-10-26 12:46:30 [ERROR] Debug logs:
failed checks.x86_64-linux.psql_orioledb-17_slim 36s
run-check-harness-psql-orioledb-17-slim: 4 of 67 tests failed. ======================= The differences that caused some tests to fail can be viewed in the fil …
run-check-harness-psql-orioledb-17-slim:
 4 of 67 tests failed. 
=======================
The differences that caused some tests to fail can be viewed in the
file "/nix/store/g55cqpbf8d0vqi6in7l7089v2y21a19r-run-check-harness-psql-orioledb-17-slim/regression_output/regression.diffs".  A copy of the test summary that you see
above is saved in the file "/nix/store/g55cqpbf8d0vqi6in7l7089v2y21a19r-run-check-harness-psql-orioledb-17-slim/regression_output/regression.out".
2026-10-26 12:46:22 [ERROR] pg_regress tests failed
2026-10-26 12:46:22 [ERROR] An error occurred. Exit code: 1
2026-10-26 12:46:22 [ERROR] Debug logs:
81 succeeded
succeeded attributes
status attribute duration
loading…
42 already built
skipped attributes
status attribute duration
loading…