1these 3 derivations will be built:2 /nix/store/v360d8wa5xp9m6iacg2q86qjh9fjxv18-start-postgres-server-test.drv3 /nix/store/q7iwj9xr7j8s7sc5w0qi6pvdi7wxcnr2-postgres-orioledb-17-check-harness.drv4 /nix/store/fh0r9j98n6amnzl83cafmzskg8vvvqcr-run-check-harness-psql-orioledb-17.drv5error: Cannot build '/nix/store/fh0r9j98n6amnzl83cafmzskg8vvvqcr-run-check-harness-psql-orioledb-17.drv'.6 Reason: builder failed with exit code 1.7 Output paths:8 /nix/store/yxl3g0ig628r9407vg5j3mjdylb1rpdp-run-check-harness-psql-orioledb-179 Last 25 log lines:10 > test z_orioledb-17_docs-cascades-deletes ... ok 86 ms11 > test z_orioledb-17_docs-full-text-search ... ok 51 ms12 > test z_orioledb-17_docs-functions ... ok 52 ms13 > test z_orioledb-17_docs-indexes ... ok 33 ms14 > test z_orioledb-17_docs-partitioning ... ok 45 ms15 > test z_orioledb-17_ext_interface ... FAILED 111 ms16 > test z_orioledb-17_extensions_schema ... FAILED 11 ms17 > test z_orioledb-17_intarray_ltree_query ... ok 10 ms18 > test z_orioledb-17_pg_stat_monitor ... ok 7 ms19 > test z_orioledb-17_pgroonga ... ok 69 ms20 > test z_orioledb-17_pgvector ... ok 20 ms21 > test z_orioledb-17_verify_orioledb ... ok 19 ms22 > test z_orioledb-17_wal_summarize ... ok 8 ms23 >24 > =======================25 > 6 of 67 tests failed.26 > =======================27 >28 > The differences that caused some tests to fail can be viewed in the29 > file "/nix/store/yxl3g0ig628r9407vg5j3mjdylb1rpdp-run-check-harness-psql-orioledb-17/regression_output/regression.diffs". A copy of the test summary that you see30 > above is saved in the file "/nix/store/yxl3g0ig628r9407vg5j3mjdylb1rpdp-run-check-harness-psql-orioledb-17/regression_output/regression.out".31 >32 > 2026-10-26 11:47:38 [ERROR] pg_regress tests failed33 > 2026-10-26 11:47:39 [ERROR] An error occurred. Exit code: 134 > 2026-10-26 11:47:39 [ERROR] Debug logs:35 For full logs, run:36 nix log /nix/store/fh0r9j98n6amnzl83cafmzskg8vvvqcr-run-check-harness-psql-orioledb-17.drv