failed attributes
| status |
attribute |
duration |
| failed |
checks.aarch64-linux.ext-pg-upgrade-start-guard
|
4m 56s |
vm-test-run-pg-upgrade-start-guard:
!!! RequestedAssertionFailed: command `systemd-run --unit=fake-initiate --collect --pipe --wait /nix/store/k4v95s7v71vjgciwm …
vm-test-run-pg-upgrade-start-guard:
!!! RequestedAssertionFailed: command `systemd-run --unit=fake-initiate --collect --pipe --wait /nix/store/k4v95s7v71vjgciwms3mkdcr71i5inx4-drive/bin/drive upgrade` failed (exit code 1)
cleanup
kill machine (pid 9)
qemu-system-aarch64: terminating on signal 15 from pid 6 (/nix/store/y88crn50yx35fiiwcjx6xqwi6ahk7mlq-python3-3.13.11/bin/python3.13)
vde_switch: EOF data port: Interrupted system call
kill vlan (pid 7)
vde_switch: (finished: cleanup, in 0.00 seconds)
Caught signal 15, cleaning up and exiting
|
| failed |
checks.aarch64-linux.psql_15
|
2m 8s |
run-check-harness-psql-15:
6 of 73 tests failed.
=======================
The differences that caused some tests to fail can be viewed in the
file "/nix/store/ …
run-check-harness-psql-15:
6 of 73 tests failed.
=======================
The differences that caused some tests to fail can be viewed in the
file "/nix/store/fdq348hijxi3lgx8a8dzywcbq026znps-run-check-harness-psql-15/regression_output/regression.diffs". A copy of the test summary that you see
above is saved in the file "/nix/store/fdq348hijxi3lgx8a8dzywcbq026znps-run-check-harness-psql-15/regression_output/regression.out".
2026-10-26 11:37:31 [ERROR] pg_regress tests failed
2026-10-26 11:37:32 [ERROR] An error occurred. Exit code: 1
2026-10-26 11:37:32 [ERROR] Debug logs:
|
| failed |
checks.aarch64-linux.psql_15_slim
|
2m 14s |
run-check-harness-psql-15-slim:
6 of 73 tests failed.
=======================
The differences that caused some tests to fail can be viewed in the
file "/nix/s …
run-check-harness-psql-15-slim:
6 of 73 tests failed.
=======================
The differences that caused some tests to fail can be viewed in the
file "/nix/store/9ai3181dkxvm8k6c10zxpjl0ci115xms-run-check-harness-psql-15-slim/regression_output/regression.diffs". A copy of the test summary that you see
above is saved in the file "/nix/store/9ai3181dkxvm8k6c10zxpjl0ci115xms-run-check-harness-psql-15-slim/regression_output/regression.out".
2026-10-26 11:37:37 [ERROR] pg_regress tests failed
2026-10-26 11:37:38 [ERROR] An error occurred. Exit code: 1
2026-10-26 11:37:38 [ERROR] Debug logs:
|
| failed |
checks.aarch64-linux.psql_17
|
1m 32s |
run-check-harness-psql-17:
6 of 70 tests failed.
=======================
The differences that caused some tests to fail can be viewed in the
file "/nix/store/ …
run-check-harness-psql-17:
6 of 70 tests failed.
=======================
The differences that caused some tests to fail can be viewed in the
file "/nix/store/cmy6v01nf7rmg550lrw1dpw1icfkvcwx-run-check-harness-psql-17/regression_output/regression.diffs". A copy of the test summary that you see
above is saved in the file "/nix/store/cmy6v01nf7rmg550lrw1dpw1icfkvcwx-run-check-harness-psql-17/regression_output/regression.out".
2026-10-26 11:36:56 [ERROR] pg_regress tests failed
2026-10-26 11:36:57 [ERROR] An error occurred. Exit code: 1
2026-10-26 11:36:57 [ERROR] Debug logs:
|
| failed |
checks.aarch64-linux.psql_17_slim
|
1m 29s |
run-check-harness-psql-17-slim:
6 of 70 tests failed.
=======================
The differences that caused some tests to fail can be viewed in the
file "/nix/s …
run-check-harness-psql-17-slim:
6 of 70 tests failed.
=======================
The differences that caused some tests to fail can be viewed in the
file "/nix/store/a0zv7pd870rwb287nsb0gr4y21rr4ywz-run-check-harness-psql-17-slim/regression_output/regression.diffs". A copy of the test summary that you see
above is saved in the file "/nix/store/a0zv7pd870rwb287nsb0gr4y21rr4ywz-run-check-harness-psql-17-slim/regression_output/regression.out".
2026-10-26 11:36:53 [ERROR] pg_regress tests failed
2026-10-26 11:36:54 [ERROR] An error occurred. Exit code: 1
2026-10-26 11:36:54 [ERROR] Debug logs:
|
| failed |
checks.aarch64-linux.psql_orioledb-17
|
1m 19s |
run-check-harness-psql-orioledb-17:
6 of 67 tests failed.
=======================
The differences that caused some tests to fail can be viewed in the
file "/n …
run-check-harness-psql-orioledb-17:
6 of 67 tests failed.
=======================
The differences that caused some tests to fail can be viewed in the
file "/nix/store/3sj154rnwnm7qv018xyilpvb6kkjdlfw-run-check-harness-psql-orioledb-17/regression_output/regression.diffs". A copy of the test summary that you see
above is saved in the file "/nix/store/3sj154rnwnm7qv018xyilpvb6kkjdlfw-run-check-harness-psql-orioledb-17/regression_output/regression.out".
2026-10-26 11:36:42 [ERROR] pg_regress tests failed
2026-10-26 11:36:43 [ERROR] An error occurred. Exit code: 1
2026-10-26 11:36:43 [ERROR] Debug logs:
|
| failed |
checks.aarch64-linux.psql_orioledb-17_slim
|
1m 8s |
run-check-harness-psql-orioledb-17-slim:
6 of 67 tests failed.
=======================
The differences that caused some tests to fail can be viewed in the
fil …
run-check-harness-psql-orioledb-17-slim:
6 of 67 tests failed.
=======================
The differences that caused some tests to fail can be viewed in the
file "/nix/store/91cgmhsy9c8gqjy41ihmamg7r5d1smc4-run-check-harness-psql-orioledb-17-slim/regression_output/regression.diffs". A copy of the test summary that you see
above is saved in the file "/nix/store/91cgmhsy9c8gqjy41ihmamg7r5d1smc4-run-check-harness-psql-orioledb-17-slim/regression_output/regression.out".
2026-10-26 11:36:55 [ERROR] pg_regress tests failed
2026-10-26 11:36:55 [ERROR] An error occurred. Exit code: 1
2026-10-26 11:36:55 [ERROR] Debug logs:
|
| failed |
checks.x86_64-linux.ext-vault
|
24s |
vm-test-run-supabase_vault:
!!! RequestedAssertionFailed: command `psql -U supabase_admin -d postgres -t -A -F"," -c "CREATE EXTENSION supabase_vault WITH VERSI …
vm-test-run-supabase_vault:
!!! RequestedAssertionFailed: command `psql -U supabase_admin -d postgres -t -A -F"," -c "CREATE EXTENSION supabase_vault WITH VERSION '0.2.8' CASCADE;" ` failed (exit code 1)
cleanup
kill machine (pid 9)
qemu-system-x86_64: terminating on signal 15 from pid 6 (/nix/store/qzc04a3npl70cyyy6flnnrb2ig3kayxm-python3-3.13.11/bin/python3.13)
vde_switch: EOF data port: Interrupted system call
kill vlan (pid 7)
(finished: cleanup, in 0.01 seconds)
vde_switch: Caught signal 15, cleaning up and exiting
|
| failed |
checks.x86_64-linux.psql_15
|
1m 16s |
run-check-harness-psql-15:
6 of 73 tests failed.
=======================
The differences that caused some tests to fail can be viewed in the
file "/nix/store/ …
run-check-harness-psql-15:
6 of 73 tests failed.
=======================
The differences that caused some tests to fail can be viewed in the
file "/nix/store/plg28nvlklzgqgviabc6hjwkb4g6mkh8-run-check-harness-psql-15/regression_output/regression.diffs". A copy of the test summary that you see
above is saved in the file "/nix/store/plg28nvlklzgqgviabc6hjwkb4g6mkh8-run-check-harness-psql-15/regression_output/regression.out".
2026-10-26 11:37:45 [ERROR] pg_regress tests failed
2026-10-26 11:37:45 [ERROR] An error occurred. Exit code: 1
2026-10-26 11:37:45 [ERROR] Debug logs:
|
| failed |
checks.x86_64-linux.psql_15_slim
|
1m 4s |
run-check-harness-psql-15-slim:
6 of 73 tests failed.
=======================
The differences that caused some tests to fail can be viewed in the
file "/nix/s …
run-check-harness-psql-15-slim:
6 of 73 tests failed.
=======================
The differences that caused some tests to fail can be viewed in the
file "/nix/store/bx3lw9wjccybjqnif73k2q6bsjw8j2vr-run-check-harness-psql-15-slim/regression_output/regression.diffs". A copy of the test summary that you see
above is saved in the file "/nix/store/bx3lw9wjccybjqnif73k2q6bsjw8j2vr-run-check-harness-psql-15-slim/regression_output/regression.out".
2026-10-26 11:45:16 [ERROR] pg_regress tests failed
2026-10-26 11:45:17 [ERROR] An error occurred. Exit code: 1
2026-10-26 11:45:17 [ERROR] Debug logs:
|
| failed |
checks.x86_64-linux.psql_17
|
35s |
run-check-harness-psql-17:
6 of 70 tests failed.
=======================
The differences that caused some tests to fail can be viewed in the
file "/nix/store/ …
run-check-harness-psql-17:
6 of 70 tests failed.
=======================
The differences that caused some tests to fail can be viewed in the
file "/nix/store/6r7v3k9hbyh7b8fhvbvsv7jk1swzx4rs-run-check-harness-psql-17/regression_output/regression.diffs". A copy of the test summary that you see
above is saved in the file "/nix/store/6r7v3k9hbyh7b8fhvbvsv7jk1swzx4rs-run-check-harness-psql-17/regression_output/regression.out".
2026-10-26 11:43:14 [ERROR] pg_regress tests failed
2026-10-26 11:43:14 [ERROR] An error occurred. Exit code: 1
2026-10-26 11:43:14 [ERROR] Debug logs:
|
| failed |
checks.x86_64-linux.psql_17_slim
|
39s |
run-check-harness-psql-17-slim:
6 of 70 tests failed.
=======================
The differences that caused some tests to fail can be viewed in the
file "/nix/s …
run-check-harness-psql-17-slim:
6 of 70 tests failed.
=======================
The differences that caused some tests to fail can be viewed in the
file "/nix/store/j10l9d5dbi86mdqxb09aia73kdsazj68-run-check-harness-psql-17-slim/regression_output/regression.diffs". A copy of the test summary that you see
above is saved in the file "/nix/store/j10l9d5dbi86mdqxb09aia73kdsazj68-run-check-harness-psql-17-slim/regression_output/regression.out".
2026-10-26 11:37:22 [ERROR] pg_regress tests failed
2026-10-26 11:37:22 [ERROR] An error occurred. Exit code: 1
2026-10-26 11:37:22 [ERROR] Debug logs:
|
| failed |
checks.x86_64-linux.psql_orioledb-17
|
37s |
run-check-harness-psql-orioledb-17:
6 of 67 tests failed.
=======================
The differences that caused some tests to fail can be viewed in the
file "/n …
run-check-harness-psql-orioledb-17:
6 of 67 tests failed.
=======================
The differences that caused some tests to fail can be viewed in the
file "/nix/store/yxl3g0ig628r9407vg5j3mjdylb1rpdp-run-check-harness-psql-orioledb-17/regression_output/regression.diffs". A copy of the test summary that you see
above is saved in the file "/nix/store/yxl3g0ig628r9407vg5j3mjdylb1rpdp-run-check-harness-psql-orioledb-17/regression_output/regression.out".
2026-10-26 11:47:38 [ERROR] pg_regress tests failed
2026-10-26 11:47:39 [ERROR] An error occurred. Exit code: 1
2026-10-26 11:47:39 [ERROR] Debug logs:
|
| failed |
checks.x86_64-linux.psql_orioledb-17_slim
|
41s |
run-check-harness-psql-orioledb-17-slim:
6 of 67 tests failed.
=======================
The differences that caused some tests to fail can be viewed in the
fil …
run-check-harness-psql-orioledb-17-slim:
6 of 67 tests failed.
=======================
The differences that caused some tests to fail can be viewed in the
file "/nix/store/9cq8rz6nnrccabk52p7436x3n09f0fj7-run-check-harness-psql-orioledb-17-slim/regression_output/regression.diffs". A copy of the test summary that you see
above is saved in the file "/nix/store/9cq8rz6nnrccabk52p7436x3n09f0fj7-run-check-harness-psql-orioledb-17-slim/regression_output/regression.out".
2026-10-26 11:42:07 [ERROR] pg_regress tests failed
2026-10-26 11:42:07 [ERROR] An error occurred. Exit code: 1
2026-10-26 11:42:07 [ERROR] Debug logs:
|