these 3 derivations will be built: /nix/store/v360d8wa5xp9m6iacg2q86qjh9fjxv18-start-postgres-server-test.drv /nix/store/q7iwj9xr7j8s7sc5w0qi6pvdi7wxcnr2-postgres-orioledb-17-check-harness.drv /nix/store/fh0r9j98n6amnzl83cafmzskg8vvvqcr-run-check-harness-psql-orioledb-17.drv error: Cannot build '/nix/store/fh0r9j98n6amnzl83cafmzskg8vvvqcr-run-check-harness-psql-orioledb-17.drv'. Reason: builder failed with exit code 1. Output paths: /nix/store/yxl3g0ig628r9407vg5j3mjdylb1rpdp-run-check-harness-psql-orioledb-17 Last 25 log lines: > test z_orioledb-17_docs-cascades-deletes ... ok 86 ms > test z_orioledb-17_docs-full-text-search ... ok 51 ms > test z_orioledb-17_docs-functions ... ok 52 ms > test z_orioledb-17_docs-indexes ... ok 33 ms > test z_orioledb-17_docs-partitioning ... ok 45 ms > test z_orioledb-17_ext_interface ... FAILED 111 ms > test z_orioledb-17_extensions_schema ... FAILED 11 ms > test z_orioledb-17_intarray_ltree_query ... ok 10 ms > test z_orioledb-17_pg_stat_monitor ... ok 7 ms > test z_orioledb-17_pgroonga ... ok 69 ms > test z_orioledb-17_pgvector ... ok 20 ms > test z_orioledb-17_verify_orioledb ... ok 19 ms > test z_orioledb-17_wal_summarize ... ok 8 ms > > ======================= > 6 of 67 tests failed. > ======================= > > The differences that caused some tests to fail can be viewed in the > file "/nix/store/yxl3g0ig628r9407vg5j3mjdylb1rpdp-run-check-harness-psql-orioledb-17/regression_output/regression.diffs". A copy of the test summary that you see > above is saved in the file "/nix/store/yxl3g0ig628r9407vg5j3mjdylb1rpdp-run-check-harness-psql-orioledb-17/regression_output/regression.out". > > 2026-10-26 11:47:38 [ERROR] pg_regress tests failed > 2026-10-26 11:47:39 [ERROR] An error occurred. Exit code: 1 > 2026-10-26 11:47:39 [ERROR] Debug logs: For full logs, run: nix log /nix/store/fh0r9j98n6amnzl83cafmzskg8vvvqcr-run-check-harness-psql-orioledb-17.drv