setup
checks.x86_64-linux.psql_17_slim
· build #459
· raw
1these 3 derivations will be built:2 /nix/store/lc5frf2dcvvmh2bxws4v31978jvyi6sk-start-postgres-server-test.drv3 /nix/store/7p076x2488ws47mn7qc72dypw4wzk2ih-postgres-17-check-harness.drv4 /nix/store/dfpvx98k9vyybvllbfjns12ba72in6s8-run-check-harness-psql-17-slim.drv5error: Cannot build '/nix/store/dfpvx98k9vyybvllbfjns12ba72in6s8-run-check-harness-psql-17-slim.drv'.6 Reason: builder failed with exit code 1.7 Output paths:8 /nix/store/j10l9d5dbi86mdqxb09aia73kdsazj68-run-check-harness-psql-17-slim9 Last 25 log lines:10 > test security ... FAILED 10 ms11 > test storage ... ok 19 ms12 > test supautils_reserved_roles ... ok 12 ms13 > test supautils_restrict_versions ... ok 109 ms14 > test vault ... ok 38 ms15 > test wal2json ... ok 16 ms16 > test z_17_ext_interface ... FAILED 173 ms17 > test z_17_intarray_ltree_query ... ok 16 ms18 > test z_17_pg_stat_monitor ... ok 8 ms19 > test z_17_pgvector ... ok 17 ms20 > test z_17_roles ... ok 19 ms21 > test z_17_rum ... ok 17 ms22 > test z_17_wal_summarize ... ok 10 ms23 >24 > =======================25 > 6 of 70 tests failed.26 > =======================27 >28 > The differences that caused some tests to fail can be viewed in the29 > file "/nix/store/j10l9d5dbi86mdqxb09aia73kdsazj68-run-check-harness-psql-17-slim/regression_output/regression.diffs". A copy of the test summary that you see30 > above is saved in the file "/nix/store/j10l9d5dbi86mdqxb09aia73kdsazj68-run-check-harness-psql-17-slim/regression_output/regression.out".31 >32 > 2026-10-26 11:37:22 [ERROR] pg_regress tests failed33 > 2026-10-26 11:37:22 [ERROR] An error occurred. Exit code: 134 > 2026-10-26 11:37:22 [ERROR] Debug logs:35 For full logs, run:36 nix log /nix/store/dfpvx98k9vyybvllbfjns12ba72in6s8-run-check-harness-psql-17-slim.drv