these 3 derivations will be built: /nix/store/lc5frf2dcvvmh2bxws4v31978jvyi6sk-start-postgres-server-test.drv /nix/store/7p076x2488ws47mn7qc72dypw4wzk2ih-postgres-17-check-harness.drv /nix/store/dfpvx98k9vyybvllbfjns12ba72in6s8-run-check-harness-psql-17-slim.drv error: Cannot build '/nix/store/dfpvx98k9vyybvllbfjns12ba72in6s8-run-check-harness-psql-17-slim.drv'. Reason: builder failed with exit code 1. Output paths: /nix/store/j10l9d5dbi86mdqxb09aia73kdsazj68-run-check-harness-psql-17-slim Last 25 log lines: > test security ... FAILED 10 ms > test storage ... ok 19 ms > test supautils_reserved_roles ... ok 12 ms > test supautils_restrict_versions ... ok 109 ms > test vault ... ok 38 ms > test wal2json ... ok 16 ms > test z_17_ext_interface ... FAILED 173 ms > test z_17_intarray_ltree_query ... ok 16 ms > test z_17_pg_stat_monitor ... ok 8 ms > test z_17_pgvector ... ok 17 ms > test z_17_roles ... ok 19 ms > test z_17_rum ... ok 17 ms > test z_17_wal_summarize ... ok 10 ms > > ======================= > 6 of 70 tests failed. > ======================= > > The differences that caused some tests to fail can be viewed in the > file "/nix/store/j10l9d5dbi86mdqxb09aia73kdsazj68-run-check-harness-psql-17-slim/regression_output/regression.diffs". A copy of the test summary that you see > above is saved in the file "/nix/store/j10l9d5dbi86mdqxb09aia73kdsazj68-run-check-harness-psql-17-slim/regression_output/regression.out". > > 2026-10-26 11:37:22 [ERROR] pg_regress tests failed > 2026-10-26 11:37:22 [ERROR] An error occurred. Exit code: 1 > 2026-10-26 11:37:22 [ERROR] Debug logs: For full logs, run: nix log /nix/store/dfpvx98k9vyybvllbfjns12ba72in6s8-run-check-harness-psql-17-slim.drv