setup
checks.x86_64-linux.psql_17
· build #459
· raw
1these 3 derivations will be built:2 /nix/store/yj379g0zskkprq0w8gfjgj3nxciy11cx-start-postgres-server-test.drv3 /nix/store/h58v84phk74ybr6zczs4aal8xs6g52fb-postgres-17-check-harness.drv4 /nix/store/81hfl0j6947q168fgs11jn6sw6rq7g5h-run-check-harness-psql-17.drv5error: Cannot build '/nix/store/81hfl0j6947q168fgs11jn6sw6rq7g5h-run-check-harness-psql-17.drv'.6 Reason: builder failed with exit code 1.7 Output paths:8 /nix/store/6r7v3k9hbyh7b8fhvbvsv7jk1swzx4rs-run-check-harness-psql-179 Last 25 log lines:10 > test security ... FAILED 11 ms11 > test storage ... ok 14 ms12 > test supautils_reserved_roles ... ok 8 ms13 > test supautils_restrict_versions ... ok 76 ms14 > test vault ... ok 27 ms15 > test wal2json ... ok 14 ms16 > test z_17_ext_interface ... FAILED 106 ms17 > test z_17_intarray_ltree_query ... ok 16 ms18 > test z_17_pg_stat_monitor ... ok 8 ms19 > test z_17_pgvector ... ok 15 ms20 > test z_17_roles ... ok 15 ms21 > test z_17_rum ... ok 14 ms22 > test z_17_wal_summarize ... ok 8 ms23 >24 > =======================25 > 6 of 70 tests failed.26 > =======================27 >28 > The differences that caused some tests to fail can be viewed in the29 > file "/nix/store/6r7v3k9hbyh7b8fhvbvsv7jk1swzx4rs-run-check-harness-psql-17/regression_output/regression.diffs". A copy of the test summary that you see30 > above is saved in the file "/nix/store/6r7v3k9hbyh7b8fhvbvsv7jk1swzx4rs-run-check-harness-psql-17/regression_output/regression.out".31 >32 > 2026-10-26 11:43:14 [ERROR] pg_regress tests failed33 > 2026-10-26 11:43:14 [ERROR] An error occurred. Exit code: 134 > 2026-10-26 11:43:14 [ERROR] Debug logs:35 For full logs, run:36 nix log /nix/store/81hfl0j6947q168fgs11jn6sw6rq7g5h-run-check-harness-psql-17.drv