these 3 derivations will be built: /nix/store/yj379g0zskkprq0w8gfjgj3nxciy11cx-start-postgres-server-test.drv /nix/store/h58v84phk74ybr6zczs4aal8xs6g52fb-postgres-17-check-harness.drv /nix/store/81hfl0j6947q168fgs11jn6sw6rq7g5h-run-check-harness-psql-17.drv error: Cannot build '/nix/store/81hfl0j6947q168fgs11jn6sw6rq7g5h-run-check-harness-psql-17.drv'. Reason: builder failed with exit code 1. Output paths: /nix/store/6r7v3k9hbyh7b8fhvbvsv7jk1swzx4rs-run-check-harness-psql-17 Last 25 log lines: > test security ... FAILED 11 ms > test storage ... ok 14 ms > test supautils_reserved_roles ... ok 8 ms > test supautils_restrict_versions ... ok 76 ms > test vault ... ok 27 ms > test wal2json ... ok 14 ms > test z_17_ext_interface ... FAILED 106 ms > test z_17_intarray_ltree_query ... ok 16 ms > test z_17_pg_stat_monitor ... ok 8 ms > test z_17_pgvector ... ok 15 ms > test z_17_roles ... ok 15 ms > test z_17_rum ... ok 14 ms > test z_17_wal_summarize ... ok 8 ms > > ======================= > 6 of 70 tests failed. > ======================= > > The differences that caused some tests to fail can be viewed in the > file "/nix/store/6r7v3k9hbyh7b8fhvbvsv7jk1swzx4rs-run-check-harness-psql-17/regression_output/regression.diffs". A copy of the test summary that you see > above is saved in the file "/nix/store/6r7v3k9hbyh7b8fhvbvsv7jk1swzx4rs-run-check-harness-psql-17/regression_output/regression.out". > > 2026-10-26 11:43:14 [ERROR] pg_regress tests failed > 2026-10-26 11:43:14 [ERROR] An error occurred. Exit code: 1 > 2026-10-26 11:43:14 [ERROR] Debug logs: For full logs, run: nix log /nix/store/81hfl0j6947q168fgs11jn6sw6rq7g5h-run-check-harness-psql-17.drv