nixbot

builds
1these 3 derivations will be built:2 /nix/store/n0647mk4qbqc9kwrnjpavaqhk16wj9kr-start-postgres-server-test.drv3 /nix/store/cqc9xj744wygwjfhpsqk2jl601pn8ypl-postgres-15-check-harness.drv4 /nix/store/hgqzz8bh5id2m2yc0c3kqvhif2k2gnv6-run-check-harness-psql-15-slim.drv5error: Cannot build '/nix/store/hgqzz8bh5id2m2yc0c3kqvhif2k2gnv6-run-check-harness-psql-15-slim.drv'.6 Reason: builder failed with exit code 1.7 Output paths:8 /nix/store/bx3lw9wjccybjqnif73k2q6bsjw8j2vr-run-check-harness-psql-15-slim9 Last 25 log lines:10 > test supautils_restrict_versions ... ok 78 ms11 > test vault ... ok 31 ms12 > test wal2json ... ok 15 ms13 > test z_15_ext_interface ... FAILED 637 ms14 > test z_15_intarray_ltree_query ... ok 13 ms15 > test z_15_pg_stat_monitor ... ok 10 ms16 > test z_15_pgjwt ... ok 19 ms17 > test z_15_pgvector ... ok 34 ms18 > test z_15_plv8 ... ok 47 ms19 > test z_15_roles ... ok 17 ms20 > test z_15_rum ... ok 18 ms21 > test z_15_timescale ... ok 23 ms22 > test z_15_unhype_timescale_to_partman ... ok 11708 ms23 >24 > =======================25 > 6 of 73 tests failed.26 > =======================27 >28 > The differences that caused some tests to fail can be viewed in the29 > file "/nix/store/bx3lw9wjccybjqnif73k2q6bsjw8j2vr-run-check-harness-psql-15-slim/regression_output/regression.diffs". A copy of the test summary that you see30 > above is saved in the file "/nix/store/bx3lw9wjccybjqnif73k2q6bsjw8j2vr-run-check-harness-psql-15-slim/regression_output/regression.out".31 >32 > 2026-10-26 11:45:16 [ERROR] pg_regress tests failed33 > 2026-10-26 11:45:17 [ERROR] An error occurred. Exit code: 134 > 2026-10-26 11:45:17 [ERROR] Debug logs:35 For full logs, run:36 nix log /nix/store/hgqzz8bh5id2m2yc0c3kqvhif2k2gnv6-run-check-harness-psql-15-slim.drv