these 3 derivations will be built: /nix/store/n0647mk4qbqc9kwrnjpavaqhk16wj9kr-start-postgres-server-test.drv /nix/store/cqc9xj744wygwjfhpsqk2jl601pn8ypl-postgres-15-check-harness.drv /nix/store/hgqzz8bh5id2m2yc0c3kqvhif2k2gnv6-run-check-harness-psql-15-slim.drv error: Cannot build '/nix/store/hgqzz8bh5id2m2yc0c3kqvhif2k2gnv6-run-check-harness-psql-15-slim.drv'. Reason: builder failed with exit code 1. Output paths: /nix/store/bx3lw9wjccybjqnif73k2q6bsjw8j2vr-run-check-harness-psql-15-slim Last 25 log lines: > test supautils_restrict_versions ... ok 78 ms > test vault ... ok 31 ms > test wal2json ... ok 15 ms > test z_15_ext_interface ... FAILED 637 ms > test z_15_intarray_ltree_query ... ok 13 ms > test z_15_pg_stat_monitor ... ok 10 ms > test z_15_pgjwt ... ok 19 ms > test z_15_pgvector ... ok 34 ms > test z_15_plv8 ... ok 47 ms > test z_15_roles ... ok 17 ms > test z_15_rum ... ok 18 ms > test z_15_timescale ... ok 23 ms > test z_15_unhype_timescale_to_partman ... ok 11708 ms > > ======================= > 6 of 73 tests failed. > ======================= > > The differences that caused some tests to fail can be viewed in the > file "/nix/store/bx3lw9wjccybjqnif73k2q6bsjw8j2vr-run-check-harness-psql-15-slim/regression_output/regression.diffs". A copy of the test summary that you see > above is saved in the file "/nix/store/bx3lw9wjccybjqnif73k2q6bsjw8j2vr-run-check-harness-psql-15-slim/regression_output/regression.out". > > 2026-10-26 11:45:16 [ERROR] pg_regress tests failed > 2026-10-26 11:45:17 [ERROR] An error occurred. Exit code: 1 > 2026-10-26 11:45:17 [ERROR] Debug logs: For full logs, run: nix log /nix/store/hgqzz8bh5id2m2yc0c3kqvhif2k2gnv6-run-check-harness-psql-15-slim.drv