nixbot

builds
1these 3 derivations will be built:2 /nix/store/vnshb8qwariiarbl2n91q33qkrmv6rdk-start-postgres-server-test.drv3 /nix/store/ymy71rqphp5j622mhw9kx4x82wqwn5al-postgres-15-check-harness.drv4 /nix/store/097s9hyzxvdh3van5ghljl20n34c89l9-run-check-harness-psql-15.drv5error: Cannot build '/nix/store/097s9hyzxvdh3van5ghljl20n34c89l9-run-check-harness-psql-15.drv'.6 Reason: builder failed with exit code 1.7 Output paths:8 /nix/store/plg28nvlklzgqgviabc6hjwkb4g6mkh8-run-check-harness-psql-159 Last 25 log lines:10 > test supautils_restrict_versions ... ok 117 ms11 > test vault ... ok 37 ms12 > test wal2json ... ok 21 ms13 > test z_15_ext_interface ... FAILED 1003 ms14 > test z_15_intarray_ltree_query ... ok 15 ms15 > test z_15_pg_stat_monitor ... ok 17 ms16 > test z_15_pgjwt ... ok 24 ms17 > test z_15_pgvector ... ok 52 ms18 > test z_15_plv8 ... ok 71 ms19 > test z_15_roles ... ok 27 ms20 > test z_15_rum ... ok 25 ms21 > test z_15_timescale ... ok 35 ms22 > test z_15_unhype_timescale_to_partman ... ok 17156 ms23 >24 > =======================25 > 6 of 73 tests failed.26 > =======================27 >28 > The differences that caused some tests to fail can be viewed in the29 > file "/nix/store/plg28nvlklzgqgviabc6hjwkb4g6mkh8-run-check-harness-psql-15/regression_output/regression.diffs". A copy of the test summary that you see30 > above is saved in the file "/nix/store/plg28nvlklzgqgviabc6hjwkb4g6mkh8-run-check-harness-psql-15/regression_output/regression.out".31 >32 > 2026-10-26 11:37:45 [ERROR] pg_regress tests failed33 > 2026-10-26 11:37:45 [ERROR] An error occurred. Exit code: 134 > 2026-10-26 11:37:45 [ERROR] Debug logs:35 For full logs, run:36 nix log /nix/store/097s9hyzxvdh3van5ghljl20n34c89l9-run-check-harness-psql-15.drv