these 3 derivations will be built: /nix/store/vnshb8qwariiarbl2n91q33qkrmv6rdk-start-postgres-server-test.drv /nix/store/ymy71rqphp5j622mhw9kx4x82wqwn5al-postgres-15-check-harness.drv /nix/store/097s9hyzxvdh3van5ghljl20n34c89l9-run-check-harness-psql-15.drv error: Cannot build '/nix/store/097s9hyzxvdh3van5ghljl20n34c89l9-run-check-harness-psql-15.drv'. Reason: builder failed with exit code 1. Output paths: /nix/store/plg28nvlklzgqgviabc6hjwkb4g6mkh8-run-check-harness-psql-15 Last 25 log lines: > test supautils_restrict_versions ... ok 117 ms > test vault ... ok 37 ms > test wal2json ... ok 21 ms > test z_15_ext_interface ... FAILED 1003 ms > test z_15_intarray_ltree_query ... ok 15 ms > test z_15_pg_stat_monitor ... ok 17 ms > test z_15_pgjwt ... ok 24 ms > test z_15_pgvector ... ok 52 ms > test z_15_plv8 ... ok 71 ms > test z_15_roles ... ok 27 ms > test z_15_rum ... ok 25 ms > test z_15_timescale ... ok 35 ms > test z_15_unhype_timescale_to_partman ... ok 17156 ms > > ======================= > 6 of 73 tests failed. > ======================= > > The differences that caused some tests to fail can be viewed in the > file "/nix/store/plg28nvlklzgqgviabc6hjwkb4g6mkh8-run-check-harness-psql-15/regression_output/regression.diffs". A copy of the test summary that you see > above is saved in the file "/nix/store/plg28nvlklzgqgviabc6hjwkb4g6mkh8-run-check-harness-psql-15/regression_output/regression.out". > > 2026-10-26 11:37:45 [ERROR] pg_regress tests failed > 2026-10-26 11:37:45 [ERROR] An error occurred. Exit code: 1 > 2026-10-26 11:37:45 [ERROR] Debug logs: For full logs, run: nix log /nix/store/097s9hyzxvdh3van5ghljl20n34c89l9-run-check-harness-psql-15.drv