setup
checks.x86_64-linux.psql_17_slim
· build #452
· raw
1this derivation will be built:2 /nix/store/p3jfbjbjb50ng8kavm2k5wkkhw8hsdl1-run-check-harness-psql-17-slim.drv3these 2 paths will be fetched (23.1 KiB download, 91.4 KiB unpacked):4 /nix/store/nmw3ixply77ryl89iapv73764y15242i-postgres-17-check-harness5 /nix/store/p8d1wgcb5m63ywjmx7npqqjipw7nnqfs-start-postgres-server-test6error: Cannot build '/nix/store/p3jfbjbjb50ng8kavm2k5wkkhw8hsdl1-run-check-harness-psql-17-slim.drv'.7 Reason: builder failed with exit code 1.8 Output paths:9 /nix/store/y64gkpz32z4fx4w9xnqzfzvyl4r4q6d7-run-check-harness-psql-17-slim10 Last 25 log lines:11 > test roles ... FAILED 13 ms12 > test security ... ok 11 ms13 > test storage ... ok 16 ms14 > test supautils_reserved_roles ... ok 8 ms15 > test supautils_restrict_versions ... ok 79 ms16 > test vault ... ok 28 ms17 > test wal2json ... ok 13 ms18 > test z_17_ext_interface ... ok 128 ms19 > test z_17_intarray_ltree_query ... ok 14 ms20 > test z_17_pg_stat_monitor ... ok 9 ms21 > test z_17_pgvector ... ok 14 ms22 > test z_17_roles ... ok 16 ms23 > test z_17_rum ... ok 14 ms24 >25 > =======================26 > 1 of 69 tests failed.27 > =======================28 >29 > The differences that caused some tests to fail can be viewed in the30 > file "/nix/store/y64gkpz32z4fx4w9xnqzfzvyl4r4q6d7-run-check-harness-psql-17-slim/regression_output/regression.diffs". A copy of the test summary that you see31 > above is saved in the file "/nix/store/y64gkpz32z4fx4w9xnqzfzvyl4r4q6d7-run-check-harness-psql-17-slim/regression_output/regression.out".32 >33 > 2026-10-26 08:31:03 [ERROR] pg_regress tests failed34 > 2026-10-26 08:31:03 [ERROR] An error occurred. Exit code: 135 > 2026-10-26 08:31:03 [ERROR] Debug logs:36 For full logs, run:37 nix log /nix/store/p3jfbjbjb50ng8kavm2k5wkkhw8hsdl1-run-check-harness-psql-17-slim.drv