this derivation will be built: /nix/store/p3jfbjbjb50ng8kavm2k5wkkhw8hsdl1-run-check-harness-psql-17-slim.drv these 2 paths will be fetched (23.1 KiB download, 91.4 KiB unpacked): /nix/store/nmw3ixply77ryl89iapv73764y15242i-postgres-17-check-harness /nix/store/p8d1wgcb5m63ywjmx7npqqjipw7nnqfs-start-postgres-server-test error: Cannot build '/nix/store/p3jfbjbjb50ng8kavm2k5wkkhw8hsdl1-run-check-harness-psql-17-slim.drv'. Reason: builder failed with exit code 1. Output paths: /nix/store/y64gkpz32z4fx4w9xnqzfzvyl4r4q6d7-run-check-harness-psql-17-slim Last 25 log lines: > test roles ... FAILED 13 ms > test security ... ok 11 ms > test storage ... ok 16 ms > test supautils_reserved_roles ... ok 8 ms > test supautils_restrict_versions ... ok 79 ms > test vault ... ok 28 ms > test wal2json ... ok 13 ms > test z_17_ext_interface ... ok 128 ms > test z_17_intarray_ltree_query ... ok 14 ms > test z_17_pg_stat_monitor ... ok 9 ms > test z_17_pgvector ... ok 14 ms > test z_17_roles ... ok 16 ms > test z_17_rum ... ok 14 ms > > ======================= > 1 of 69 tests failed. > ======================= > > The differences that caused some tests to fail can be viewed in the > file "/nix/store/y64gkpz32z4fx4w9xnqzfzvyl4r4q6d7-run-check-harness-psql-17-slim/regression_output/regression.diffs". A copy of the test summary that you see > above is saved in the file "/nix/store/y64gkpz32z4fx4w9xnqzfzvyl4r4q6d7-run-check-harness-psql-17-slim/regression_output/regression.out". > > 2026-10-26 08:31:03 [ERROR] pg_regress tests failed > 2026-10-26 08:31:03 [ERROR] An error occurred. Exit code: 1 > 2026-10-26 08:31:03 [ERROR] Debug logs: For full logs, run: nix log /nix/store/p3jfbjbjb50ng8kavm2k5wkkhw8hsdl1-run-check-harness-psql-17-slim.drv