nixbot

builds

supabase/postgres build #452 failed

branch develop · PR #2105 · commit dfee55a444 · · took 1h 12m · eval 1m 59s

12 failed
failed attributes
status attribute duration
failed checks.aarch64-linux.psql_15 1m 41s
run-check-harness-psql-15: 1 of 73 tests failed. ======================= The differences that caused some tests to fail can be viewed in the file "/nix/store/ …
run-check-harness-psql-15:
 1 of 73 tests failed. 
=======================
The differences that caused some tests to fail can be viewed in the
file "/nix/store/ig3sl39wv19a6p9fprf2lxhwn4aa2yd2-run-check-harness-psql-15/regression_output/regression.diffs".  A copy of the test summary that you see
above is saved in the file "/nix/store/ig3sl39wv19a6p9fprf2lxhwn4aa2yd2-run-check-harness-psql-15/regression_output/regression.out".
2026-10-26 08:26:45 [ERROR] pg_regress tests failed
2026-10-26 08:26:45 [ERROR] An error occurred. Exit code: 1
2026-10-26 08:26:45 [ERROR] Debug logs:
failed checks.aarch64-linux.psql_15_slim 1m 38s
run-check-harness-psql-15-slim: 1 of 73 tests failed. ======================= The differences that caused some tests to fail can be viewed in the file "/nix/s …
run-check-harness-psql-15-slim:
 1 of 73 tests failed. 
=======================
The differences that caused some tests to fail can be viewed in the
file "/nix/store/bv4a5zax4z0x0zx4fbxvq4lgw5lc64df-run-check-harness-psql-15-slim/regression_output/regression.diffs".  A copy of the test summary that you see
above is saved in the file "/nix/store/bv4a5zax4z0x0zx4fbxvq4lgw5lc64df-run-check-harness-psql-15-slim/regression_output/regression.out".
2026-10-26 08:30:06 [ERROR] pg_regress tests failed
2026-10-26 08:30:06 [ERROR] An error occurred. Exit code: 1
2026-10-26 08:30:06 [ERROR] Debug logs:
failed checks.aarch64-linux.psql_17 49s
run-check-harness-psql-17: 1 of 69 tests failed. ======================= The differences that caused some tests to fail can be viewed in the file "/nix/store/ …
run-check-harness-psql-17:
 1 of 69 tests failed. 
=======================
The differences that caused some tests to fail can be viewed in the
file "/nix/store/3ypz3i8ca512mbh8dw46b4xgzlrjbjh7-run-check-harness-psql-17/regression_output/regression.diffs".  A copy of the test summary that you see
above is saved in the file "/nix/store/3ypz3i8ca512mbh8dw46b4xgzlrjbjh7-run-check-harness-psql-17/regression_output/regression.out".
2026-10-26 08:28:26 [ERROR] pg_regress tests failed
2026-10-26 08:28:26 [ERROR] An error occurred. Exit code: 1
2026-10-26 08:28:26 [ERROR] Debug logs:
failed checks.aarch64-linux.psql_17_slim 49s
run-check-harness-psql-17-slim: 1 of 69 tests failed. ======================= The differences that caused some tests to fail can be viewed in the file "/nix/s …
run-check-harness-psql-17-slim:
 1 of 69 tests failed. 
=======================
The differences that caused some tests to fail can be viewed in the
file "/nix/store/8fj856iqlg2b45fya72i0yxzj74nmymc-run-check-harness-psql-17-slim/regression_output/regression.diffs".  A copy of the test summary that you see
above is saved in the file "/nix/store/8fj856iqlg2b45fya72i0yxzj74nmymc-run-check-harness-psql-17-slim/regression_output/regression.out".
2026-10-26 08:30:18 [ERROR] pg_regress tests failed
2026-10-26 08:30:18 [ERROR] An error occurred. Exit code: 1
2026-10-26 08:30:18 [ERROR] Debug logs:
failed checks.aarch64-linux.psql_orioledb-17 52s
run-check-harness-psql-orioledb-17: 1 of 66 tests failed. ======================= The differences that caused some tests to fail can be viewed in the file "/n …
run-check-harness-psql-orioledb-17:
 1 of 66 tests failed. 
=======================
The differences that caused some tests to fail can be viewed in the
file "/nix/store/1p1fzgcizr1q5d88a7zy9akkf8mp08gk-run-check-harness-psql-orioledb-17/regression_output/regression.diffs".  A copy of the test summary that you see
above is saved in the file "/nix/store/1p1fzgcizr1q5d88a7zy9akkf8mp08gk-run-check-harness-psql-orioledb-17/regression_output/regression.out".
2026-10-26 08:25:55 [ERROR] pg_regress tests failed
2026-10-26 08:25:55 [ERROR] An error occurred. Exit code: 1
2026-10-26 08:25:55 [ERROR] Debug logs:
failed checks.aarch64-linux.psql_orioledb-17_slim 50s
run-check-harness-psql-orioledb-17-slim: 1 of 66 tests failed. ======================= The differences that caused some tests to fail can be viewed in the fil …
run-check-harness-psql-orioledb-17-slim:
 1 of 66 tests failed. 
=======================
The differences that caused some tests to fail can be viewed in the
file "/nix/store/nhrhfwm4igj8gq7dcpw4zx79a2p9y3hz-run-check-harness-psql-orioledb-17-slim/regression_output/regression.diffs".  A copy of the test summary that you see
above is saved in the file "/nix/store/nhrhfwm4igj8gq7dcpw4zx79a2p9y3hz-run-check-harness-psql-orioledb-17-slim/regression_output/regression.out".
2026-10-26 08:27:36 [ERROR] pg_regress tests failed
2026-10-26 08:27:36 [ERROR] An error occurred. Exit code: 1
2026-10-26 08:27:36 [ERROR] Debug logs:
failed checks.x86_64-linux.psql_15 59s
run-check-harness-psql-15: 1 of 73 tests failed. ======================= The differences that caused some tests to fail can be viewed in the file "/nix/store/ …
run-check-harness-psql-15:
 1 of 73 tests failed. 
=======================
The differences that caused some tests to fail can be viewed in the
file "/nix/store/0v8wrdal0dfdl7i942g9q561vn5w2fzy-run-check-harness-psql-15/regression_output/regression.diffs".  A copy of the test summary that you see
above is saved in the file "/nix/store/0v8wrdal0dfdl7i942g9q561vn5w2fzy-run-check-harness-psql-15/regression_output/regression.out".
2026-10-26 08:32:05 [ERROR] pg_regress tests failed
2026-10-26 08:32:05 [ERROR] An error occurred. Exit code: 1
2026-10-26 08:32:05 [ERROR] Debug logs:
failed checks.x86_64-linux.psql_15_slim 59s
run-check-harness-psql-15-slim: 1 of 73 tests failed. ======================= The differences that caused some tests to fail can be viewed in the file "/nix/s …
run-check-harness-psql-15-slim:
 1 of 73 tests failed. 
=======================
The differences that caused some tests to fail can be viewed in the
file "/nix/store/5c47p9f8i7w5196g3bk5y7rf0plkyh8f-run-check-harness-psql-15-slim/regression_output/regression.diffs".  A copy of the test summary that you see
above is saved in the file "/nix/store/5c47p9f8i7w5196g3bk5y7rf0plkyh8f-run-check-harness-psql-15-slim/regression_output/regression.out".
2026-10-26 08:32:06 [ERROR] pg_regress tests failed
2026-10-26 08:32:06 [ERROR] An error occurred. Exit code: 1
2026-10-26 08:32:06 [ERROR] Debug logs:
failed checks.x86_64-linux.psql_17 31s
run-check-harness-psql-17: 1 of 69 tests failed. ======================= The differences that caused some tests to fail can be viewed in the file "/nix/store/ …
run-check-harness-psql-17:
 1 of 69 tests failed. 
=======================
The differences that caused some tests to fail can be viewed in the
file "/nix/store/r2bq0hrjg347b7wwfhw47v96xvb1vpda-run-check-harness-psql-17/regression_output/regression.diffs".  A copy of the test summary that you see
above is saved in the file "/nix/store/r2bq0hrjg347b7wwfhw47v96xvb1vpda-run-check-harness-psql-17/regression_output/regression.out".
2026-10-26 08:32:06 [ERROR] pg_regress tests failed
2026-10-26 08:32:06 [ERROR] An error occurred. Exit code: 1
2026-10-26 08:32:06 [ERROR] Debug logs:
failed checks.x86_64-linux.psql_17_slim 31s
run-check-harness-psql-17-slim: 1 of 69 tests failed. ======================= The differences that caused some tests to fail can be viewed in the file "/nix/s …
run-check-harness-psql-17-slim:
 1 of 69 tests failed. 
=======================
The differences that caused some tests to fail can be viewed in the
file "/nix/store/y64gkpz32z4fx4w9xnqzfzvyl4r4q6d7-run-check-harness-psql-17-slim/regression_output/regression.diffs".  A copy of the test summary that you see
above is saved in the file "/nix/store/y64gkpz32z4fx4w9xnqzfzvyl4r4q6d7-run-check-harness-psql-17-slim/regression_output/regression.out".
2026-10-26 08:31:03 [ERROR] pg_regress tests failed
2026-10-26 08:31:03 [ERROR] An error occurred. Exit code: 1
2026-10-26 08:31:03 [ERROR] Debug logs:
failed checks.x86_64-linux.psql_orioledb-17 32s
run-check-harness-psql-orioledb-17: 1 of 66 tests failed. ======================= The differences that caused some tests to fail can be viewed in the file "/n …
run-check-harness-psql-orioledb-17:
 1 of 66 tests failed. 
=======================
The differences that caused some tests to fail can be viewed in the
file "/nix/store/2fb55jdiqhvq36kq3yqm06igli69zgrp-run-check-harness-psql-orioledb-17/regression_output/regression.diffs".  A copy of the test summary that you see
above is saved in the file "/nix/store/2fb55jdiqhvq36kq3yqm06igli69zgrp-run-check-harness-psql-orioledb-17/regression_output/regression.out".
2026-10-26 08:32:26 [ERROR] pg_regress tests failed
2026-10-26 08:32:26 [ERROR] An error occurred. Exit code: 1
2026-10-26 08:32:26 [ERROR] Debug logs:
failed checks.x86_64-linux.psql_orioledb-17_slim 32s
run-check-harness-psql-orioledb-17-slim: 1 of 66 tests failed. ======================= The differences that caused some tests to fail can be viewed in the fil …
run-check-harness-psql-orioledb-17-slim:
 1 of 66 tests failed. 
=======================
The differences that caused some tests to fail can be viewed in the
file "/nix/store/1c83y909fg1xxgz2zwh2qpzvn3hy5d0g-run-check-harness-psql-orioledb-17-slim/regression_output/regression.diffs".  A copy of the test summary that you see
above is saved in the file "/nix/store/1c83y909fg1xxgz2zwh2qpzvn3hy5d0g-run-check-harness-psql-orioledb-17-slim/regression_output/regression.out".
2026-10-26 08:31:34 [ERROR] pg_regress tests failed
2026-10-26 08:31:34 [ERROR] An error occurred. Exit code: 1
2026-10-26 08:31:34 [ERROR] Debug logs:
76 succeeded
succeeded attributes
status attribute duration
loading…
48 already built
skipped attributes
status attribute duration
loading…