setup
checks.x86_64-linux.psql_17
· build #452
· raw
1this derivation will be built:2 /nix/store/vsv0jhhjq5j9b35r3kahnac8w1v5hrab-run-check-harness-psql-17.drv3these 2 paths will be fetched (23.1 KiB download, 91.4 KiB unpacked):4 /nix/store/zqp6sgrfmxcdjy2j1ndzx2bp9byiwqzr-postgres-17-check-harness5 /nix/store/26f7j604xj40m34sy6xirwbjbvsgr1ry-start-postgres-server-test6error: Cannot build '/nix/store/vsv0jhhjq5j9b35r3kahnac8w1v5hrab-run-check-harness-psql-17.drv'.7 Reason: builder failed with exit code 1.8 Output paths:9 /nix/store/r2bq0hrjg347b7wwfhw47v96xvb1vpda-run-check-harness-psql-1710 Last 25 log lines:11 > test roles ... FAILED 11 ms12 > test security ... ok 10 ms13 > test storage ... ok 13 ms14 > test supautils_reserved_roles ... ok 8 ms15 > test supautils_restrict_versions ... ok 80 ms16 > test vault ... ok 28 ms17 > test wal2json ... ok 15 ms18 > test z_17_ext_interface ... ok 112 ms19 > test z_17_intarray_ltree_query ... ok 14 ms20 > test z_17_pg_stat_monitor ... ok 8 ms21 > test z_17_pgvector ... ok 13 ms22 > test z_17_roles ... ok 15 ms23 > test z_17_rum ... ok 15 ms24 >25 > =======================26 > 1 of 69 tests failed.27 > =======================28 >29 > The differences that caused some tests to fail can be viewed in the30 > file "/nix/store/r2bq0hrjg347b7wwfhw47v96xvb1vpda-run-check-harness-psql-17/regression_output/regression.diffs". A copy of the test summary that you see31 > above is saved in the file "/nix/store/r2bq0hrjg347b7wwfhw47v96xvb1vpda-run-check-harness-psql-17/regression_output/regression.out".32 >33 > 2026-10-26 08:32:06 [ERROR] pg_regress tests failed34 > 2026-10-26 08:32:06 [ERROR] An error occurred. Exit code: 135 > 2026-10-26 08:32:06 [ERROR] Debug logs:36 For full logs, run:37 nix log /nix/store/vsv0jhhjq5j9b35r3kahnac8w1v5hrab-run-check-harness-psql-17.drv