this derivation will be built: /nix/store/vsv0jhhjq5j9b35r3kahnac8w1v5hrab-run-check-harness-psql-17.drv these 2 paths will be fetched (23.1 KiB download, 91.4 KiB unpacked): /nix/store/zqp6sgrfmxcdjy2j1ndzx2bp9byiwqzr-postgres-17-check-harness /nix/store/26f7j604xj40m34sy6xirwbjbvsgr1ry-start-postgres-server-test error: Cannot build '/nix/store/vsv0jhhjq5j9b35r3kahnac8w1v5hrab-run-check-harness-psql-17.drv'. Reason: builder failed with exit code 1. Output paths: /nix/store/r2bq0hrjg347b7wwfhw47v96xvb1vpda-run-check-harness-psql-17 Last 25 log lines: > test roles ... FAILED 11 ms > test security ... ok 10 ms > test storage ... ok 13 ms > test supautils_reserved_roles ... ok 8 ms > test supautils_restrict_versions ... ok 80 ms > test vault ... ok 28 ms > test wal2json ... ok 15 ms > test z_17_ext_interface ... ok 112 ms > test z_17_intarray_ltree_query ... ok 14 ms > test z_17_pg_stat_monitor ... ok 8 ms > test z_17_pgvector ... ok 13 ms > test z_17_roles ... ok 15 ms > test z_17_rum ... ok 15 ms > > ======================= > 1 of 69 tests failed. > ======================= > > The differences that caused some tests to fail can be viewed in the > file "/nix/store/r2bq0hrjg347b7wwfhw47v96xvb1vpda-run-check-harness-psql-17/regression_output/regression.diffs". A copy of the test summary that you see > above is saved in the file "/nix/store/r2bq0hrjg347b7wwfhw47v96xvb1vpda-run-check-harness-psql-17/regression_output/regression.out". > > 2026-10-26 08:32:06 [ERROR] pg_regress tests failed > 2026-10-26 08:32:06 [ERROR] An error occurred. Exit code: 1 > 2026-10-26 08:32:06 [ERROR] Debug logs: For full logs, run: nix log /nix/store/vsv0jhhjq5j9b35r3kahnac8w1v5hrab-run-check-harness-psql-17.drv