nixbot

builds
1this derivation will be built:2 /nix/store/gnsgdr1f54p5lv0h0svxp1vxxa2nhmp1-run-check-harness-psql-15-slim.drv3these 2 paths will be fetched (23.1 KiB download, 91.6 KiB unpacked):4 /nix/store/rcap5jlyhmxyn7mfnyvkxnimvz6i1mlx-postgres-15-check-harness5 /nix/store/pfnr7jw3a2zjfp9cv0vimnfi22ld7lh1-start-postgres-server-test6error: Cannot build '/nix/store/gnsgdr1f54p5lv0h0svxp1vxxa2nhmp1-run-check-harness-psql-15-slim.drv'.7 Reason: builder failed with exit code 1.8 Output paths:9 /nix/store/5c47p9f8i7w5196g3bk5y7rf0plkyh8f-run-check-harness-psql-15-slim10 Last 25 log lines:11 > test supautils_restrict_versions ... ok 83 ms12 > test vault ... ok 29 ms13 > test wal2json ... ok 15 ms14 > test z_15_ext_interface ... ok 619 ms15 > test z_15_intarray_ltree_query ... ok 12 ms16 > test z_15_pg_stat_monitor ... ok 11 ms17 > test z_15_pgjwt ... ok 17 ms18 > test z_15_pgvector ... ok 32 ms19 > test z_15_plv8 ... ok 48 ms20 > test z_15_roles ... ok 17 ms21 > test z_15_rum ... ok 18 ms22 > test z_15_timescale ... ok 24 ms23 > test z_15_unhype_timescale_to_partman ... ok 11737 ms24 >25 > =======================26 > 1 of 73 tests failed.27 > =======================28 >29 > The differences that caused some tests to fail can be viewed in the30 > file "/nix/store/5c47p9f8i7w5196g3bk5y7rf0plkyh8f-run-check-harness-psql-15-slim/regression_output/regression.diffs". A copy of the test summary that you see31 > above is saved in the file "/nix/store/5c47p9f8i7w5196g3bk5y7rf0plkyh8f-run-check-harness-psql-15-slim/regression_output/regression.out".32 >33 > 2026-10-26 08:32:06 [ERROR] pg_regress tests failed34 > 2026-10-26 08:32:06 [ERROR] An error occurred. Exit code: 135 > 2026-10-26 08:32:06 [ERROR] Debug logs:36 For full logs, run:37 nix log /nix/store/gnsgdr1f54p5lv0h0svxp1vxxa2nhmp1-run-check-harness-psql-15-slim.drv