this derivation will be built: /nix/store/gnsgdr1f54p5lv0h0svxp1vxxa2nhmp1-run-check-harness-psql-15-slim.drv these 2 paths will be fetched (23.1 KiB download, 91.6 KiB unpacked): /nix/store/rcap5jlyhmxyn7mfnyvkxnimvz6i1mlx-postgres-15-check-harness /nix/store/pfnr7jw3a2zjfp9cv0vimnfi22ld7lh1-start-postgres-server-test error: Cannot build '/nix/store/gnsgdr1f54p5lv0h0svxp1vxxa2nhmp1-run-check-harness-psql-15-slim.drv'. Reason: builder failed with exit code 1. Output paths: /nix/store/5c47p9f8i7w5196g3bk5y7rf0plkyh8f-run-check-harness-psql-15-slim Last 25 log lines: > test supautils_restrict_versions ... ok 83 ms > test vault ... ok 29 ms > test wal2json ... ok 15 ms > test z_15_ext_interface ... ok 619 ms > test z_15_intarray_ltree_query ... ok 12 ms > test z_15_pg_stat_monitor ... ok 11 ms > test z_15_pgjwt ... ok 17 ms > test z_15_pgvector ... ok 32 ms > test z_15_plv8 ... ok 48 ms > test z_15_roles ... ok 17 ms > test z_15_rum ... ok 18 ms > test z_15_timescale ... ok 24 ms > test z_15_unhype_timescale_to_partman ... ok 11737 ms > > ======================= > 1 of 73 tests failed. > ======================= > > The differences that caused some tests to fail can be viewed in the > file "/nix/store/5c47p9f8i7w5196g3bk5y7rf0plkyh8f-run-check-harness-psql-15-slim/regression_output/regression.diffs". A copy of the test summary that you see > above is saved in the file "/nix/store/5c47p9f8i7w5196g3bk5y7rf0plkyh8f-run-check-harness-psql-15-slim/regression_output/regression.out". > > 2026-10-26 08:32:06 [ERROR] pg_regress tests failed > 2026-10-26 08:32:06 [ERROR] An error occurred. Exit code: 1 > 2026-10-26 08:32:06 [ERROR] Debug logs: For full logs, run: nix log /nix/store/gnsgdr1f54p5lv0h0svxp1vxxa2nhmp1-run-check-harness-psql-15-slim.drv