nixbot

builds
1these 3 derivations will be built:2 /nix/store/lv4gy88kc3s3w4mg50355qin9rz0j0hm-start-postgres-server-test.drv3 /nix/store/6nrd5q5s5qln2lnmhk6x98f8337rc6ng-postgres-orioledb-17-check-harness.drv4 /nix/store/lsjjhkvnlk4izbxsn2vicilfx32f6anf-run-check-harness-psql-orioledb-17.drv5error: Cannot build '/nix/store/lsjjhkvnlk4izbxsn2vicilfx32f6anf-run-check-harness-psql-orioledb-17.drv'.6 Reason: builder failed with exit code 1.7 Output paths:8 /nix/store/05a6sk3k81g26jhm2mnnrgbcg9q8c1sk-run-check-harness-psql-orioledb-179 Last 25 log lines:10 > test wal2json ... ok 19 ms11 > test z_orioledb-17_docs-cascades-deletes ... ok 86 ms12 > test z_orioledb-17_docs-full-text-search ... ok 32 ms13 > test z_orioledb-17_docs-functions ... ok 360 ms14 > test z_orioledb-17_docs-indexes ... ok 27 ms15 > test z_orioledb-17_docs-partitioning ... ok 38 ms16 > test z_orioledb-17_ext_interface ... ok 114 ms17 > test z_orioledb-17_extensions_schema ... ok 10 ms18 > test z_orioledb-17_intarray_ltree_query ... ok 10 ms19 > test z_orioledb-17_pg_stat_monitor ... ok 8 ms20 > test z_orioledb-17_pgroonga ... ok 54 ms21 > test z_orioledb-17_pgvector ... ok 18 ms22 > test z_orioledb-17_verify_orioledb ... ok 15 ms23 >24 > =======================25 > 1 of 66 tests failed.26 > =======================27 >28 > The differences that caused some tests to fail can be viewed in the29 > file "/nix/store/05a6sk3k81g26jhm2mnnrgbcg9q8c1sk-run-check-harness-psql-orioledb-17/regression_output/regression.diffs". A copy of the test summary that you see30 > above is saved in the file "/nix/store/05a6sk3k81g26jhm2mnnrgbcg9q8c1sk-run-check-harness-psql-orioledb-17/regression_output/regression.out".31 >32 > 2026-10-23 15:15:56 [ERROR] pg_regress tests failed33 > 2026-10-23 15:15:56 [ERROR] An error occurred. Exit code: 134 > 2026-10-23 15:15:56 [ERROR] Debug logs:35 For full logs, run:36 nix log /nix/store/lsjjhkvnlk4izbxsn2vicilfx32f6anf-run-check-harness-psql-orioledb-17.drv