nixbot

builds

supabase/postgres build #444 failed

branch develop · PR #2592 · commit 6c156b030b · · took 18m 26s · eval 8m 35s

4 failed
failed attributes
status attribute duration
failed checks.aarch64-linux.psql_orioledb-17 56s
run-check-harness-psql-orioledb-17: 1 of 66 tests failed. ======================= The differences that caused some tests to fail can be viewed in the file "/n …
run-check-harness-psql-orioledb-17:
 1 of 66 tests failed. 
=======================
The differences that caused some tests to fail can be viewed in the
file "/nix/store/05vvpx8rvbfzgkkhvp57an9l11qrp35w-run-check-harness-psql-orioledb-17/regression_output/regression.diffs".  A copy of the test summary that you see
above is saved in the file "/nix/store/05vvpx8rvbfzgkkhvp57an9l11qrp35w-run-check-harness-psql-orioledb-17/regression_output/regression.out".
2026-10-23 15:12:00 [ERROR] pg_regress tests failed
2026-10-23 15:12:00 [ERROR] An error occurred. Exit code: 1
2026-10-23 15:12:00 [ERROR] Debug logs:
failed checks.aarch64-linux.psql_orioledb-17_slim 55s
run-check-harness-psql-orioledb-17-slim: 1 of 66 tests failed. ======================= The differences that caused some tests to fail can be viewed in the fil …
run-check-harness-psql-orioledb-17-slim:
 1 of 66 tests failed. 
=======================
The differences that caused some tests to fail can be viewed in the
file "/nix/store/rl05dlr6rhyh9nk8hcq4g91s28ghsh90-run-check-harness-psql-orioledb-17-slim/regression_output/regression.diffs".  A copy of the test summary that you see
above is saved in the file "/nix/store/rl05dlr6rhyh9nk8hcq4g91s28ghsh90-run-check-harness-psql-orioledb-17-slim/regression_output/regression.out".
2026-10-23 15:12:52 [ERROR] pg_regress tests failed
2026-10-23 15:12:52 [ERROR] An error occurred. Exit code: 1
2026-10-23 15:12:52 [ERROR] Debug logs:
failed checks.x86_64-linux.psql_orioledb-17 36s
run-check-harness-psql-orioledb-17: 1 of 66 tests failed. ======================= The differences that caused some tests to fail can be viewed in the file "/n …
run-check-harness-psql-orioledb-17:
 1 of 66 tests failed. 
=======================
The differences that caused some tests to fail can be viewed in the
file "/nix/store/05a6sk3k81g26jhm2mnnrgbcg9q8c1sk-run-check-harness-psql-orioledb-17/regression_output/regression.diffs".  A copy of the test summary that you see
above is saved in the file "/nix/store/05a6sk3k81g26jhm2mnnrgbcg9q8c1sk-run-check-harness-psql-orioledb-17/regression_output/regression.out".
2026-10-23 15:15:56 [ERROR] pg_regress tests failed
2026-10-23 15:15:56 [ERROR] An error occurred. Exit code: 1
2026-10-23 15:15:56 [ERROR] Debug logs:
failed checks.x86_64-linux.psql_orioledb-17_slim 36s
run-check-harness-psql-orioledb-17-slim: 1 of 66 tests failed. ======================= The differences that caused some tests to fail can be viewed in the fil …
run-check-harness-psql-orioledb-17-slim:
 1 of 66 tests failed. 
=======================
The differences that caused some tests to fail can be viewed in the
file "/nix/store/h77drpxgamdfa4x49hgn7ly76gbhm3q0-run-check-harness-psql-orioledb-17-slim/regression_output/regression.diffs".  A copy of the test summary that you see
above is saved in the file "/nix/store/h77drpxgamdfa4x49hgn7ly76gbhm3q0-run-check-harness-psql-orioledb-17-slim/regression_output/regression.out".
2026-10-23 15:16:08 [ERROR] pg_regress tests failed
2026-10-23 15:16:08 [ERROR] An error occurred. Exit code: 1
2026-10-23 15:16:08 [ERROR] Debug logs:
20 cancelled
cancelled attributes
status attribute duration
loading…
64 succeeded
succeeded attributes
status attribute duration
loading…
48 already built
skipped attributes
status attribute duration
loading…