these 3 derivations will be built: /nix/store/lv4gy88kc3s3w4mg50355qin9rz0j0hm-start-postgres-server-test.drv /nix/store/6nrd5q5s5qln2lnmhk6x98f8337rc6ng-postgres-orioledb-17-check-harness.drv /nix/store/lsjjhkvnlk4izbxsn2vicilfx32f6anf-run-check-harness-psql-orioledb-17.drv error: Cannot build '/nix/store/lsjjhkvnlk4izbxsn2vicilfx32f6anf-run-check-harness-psql-orioledb-17.drv'. Reason: builder failed with exit code 1. Output paths: /nix/store/05a6sk3k81g26jhm2mnnrgbcg9q8c1sk-run-check-harness-psql-orioledb-17 Last 25 log lines: > test wal2json ... ok 19 ms > test z_orioledb-17_docs-cascades-deletes ... ok 86 ms > test z_orioledb-17_docs-full-text-search ... ok 32 ms > test z_orioledb-17_docs-functions ... ok 360 ms > test z_orioledb-17_docs-indexes ... ok 27 ms > test z_orioledb-17_docs-partitioning ... ok 38 ms > test z_orioledb-17_ext_interface ... ok 114 ms > test z_orioledb-17_extensions_schema ... ok 10 ms > test z_orioledb-17_intarray_ltree_query ... ok 10 ms > test z_orioledb-17_pg_stat_monitor ... ok 8 ms > test z_orioledb-17_pgroonga ... ok 54 ms > test z_orioledb-17_pgvector ... ok 18 ms > test z_orioledb-17_verify_orioledb ... ok 15 ms > > ======================= > 1 of 66 tests failed. > ======================= > > The differences that caused some tests to fail can be viewed in the > file "/nix/store/05a6sk3k81g26jhm2mnnrgbcg9q8c1sk-run-check-harness-psql-orioledb-17/regression_output/regression.diffs". A copy of the test summary that you see > above is saved in the file "/nix/store/05a6sk3k81g26jhm2mnnrgbcg9q8c1sk-run-check-harness-psql-orioledb-17/regression_output/regression.out". > > 2026-10-23 15:15:56 [ERROR] pg_regress tests failed > 2026-10-23 15:15:56 [ERROR] An error occurred. Exit code: 1 > 2026-10-23 15:15:56 [ERROR] Debug logs: For full logs, run: nix log /nix/store/lsjjhkvnlk4izbxsn2vicilfx32f6anf-run-check-harness-psql-orioledb-17.drv