nixbot

builds
1these 3 derivations will be built:2 /nix/store/mgzdqz7y6bmawg2xnq74ha1r1pgwmbq7-start-postgres-server-test.drv3 /nix/store/gl108ri5qihxwpxifpmf3dmmldvf458f-postgres-orioledb-17-check-harness.drv4 /nix/store/3isdimwl76m1kpclaj538mvypa5vk8sg-run-check-harness-psql-orioledb-17.drv5error: Cannot build '/nix/store/3isdimwl76m1kpclaj538mvypa5vk8sg-run-check-harness-psql-orioledb-17.drv'.6 Reason: builder failed with exit code 1.7 Output paths:8 /nix/store/142qhhzhgb80bczxsms33ha7ch8x7a4l-run-check-harness-psql-orioledb-179 Last 25 log lines:10 > test wal2json ... ok 18 ms11 > test z_orioledb-17_docs-cascades-deletes ... ok 83 ms12 > test z_orioledb-17_docs-full-text-search ... ok 31 ms13 > test z_orioledb-17_docs-functions ... ok 343 ms14 > test z_orioledb-17_docs-indexes ... ok 31 ms15 > test z_orioledb-17_docs-partitioning ... ok 38 ms16 > test z_orioledb-17_ext_interface ... ok 113 ms17 > test z_orioledb-17_extensions_schema ... ok 8 ms18 > test z_orioledb-17_intarray_ltree_query ... ok 9 ms19 > test z_orioledb-17_pg_stat_monitor ... ok 7 ms20 > test z_orioledb-17_pgroonga ... ok 56 ms21 > test z_orioledb-17_pgvector ... ok 18 ms22 > test z_orioledb-17_verify_orioledb ... ok 16 ms23 >24 > =======================25 > 1 of 66 tests failed.26 > =======================27 >28 > The differences that caused some tests to fail can be viewed in the29 > file "/nix/store/142qhhzhgb80bczxsms33ha7ch8x7a4l-run-check-harness-psql-orioledb-17/regression_output/regression.diffs". A copy of the test summary that you see30 > above is saved in the file "/nix/store/142qhhzhgb80bczxsms33ha7ch8x7a4l-run-check-harness-psql-orioledb-17/regression_output/regression.out".31 >32 > 2026-10-21 01:59:32 [ERROR] pg_regress tests failed33 > 2026-10-21 01:59:32 [ERROR] An error occurred. Exit code: 134 > 2026-10-21 01:59:32 [ERROR] Debug logs:35 For full logs, run:36 nix log /nix/store/3isdimwl76m1kpclaj538mvypa5vk8sg-run-check-harness-psql-orioledb-17.drv