nixbot

builds

supabase/postgres build #405 failed

branch develop · PR #2105 · commit 27fc87c112 · · took 1h 6m · eval 2m 23s

12 failed
failed attributes
status attribute duration
failed checks.aarch64-linux.psql_15 1m 37s
run-check-harness-psql-15: 1 of 73 tests failed. ======================= The differences that caused some tests to fail can be viewed in the file "/nix/store/ …
run-check-harness-psql-15:
 1 of 73 tests failed. 
=======================
The differences that caused some tests to fail can be viewed in the
file "/nix/store/z7h1iz4d9dp4awfx5a15q422692nrgc6-run-check-harness-psql-15/regression_output/regression.diffs".  A copy of the test summary that you see
above is saved in the file "/nix/store/z7h1iz4d9dp4awfx5a15q422692nrgc6-run-check-harness-psql-15/regression_output/regression.out".
2026-10-21 01:51:09 [ERROR] pg_regress tests failed
2026-10-21 01:51:09 [ERROR] An error occurred. Exit code: 1
2026-10-21 01:51:09 [ERROR] Debug logs:
failed checks.aarch64-linux.psql_15_slim 1m 33s
run-check-harness-psql-15-slim: 1 of 73 tests failed. ======================= The differences that caused some tests to fail can be viewed in the file "/nix/s …
run-check-harness-psql-15-slim:
 1 of 73 tests failed. 
=======================
The differences that caused some tests to fail can be viewed in the
file "/nix/store/4v5pklmmdk0bdfpa9anffa0r5v07g5x7-run-check-harness-psql-15-slim/regression_output/regression.diffs".  A copy of the test summary that you see
above is saved in the file "/nix/store/4v5pklmmdk0bdfpa9anffa0r5v07g5x7-run-check-harness-psql-15-slim/regression_output/regression.out".
2026-10-21 01:52:38 [ERROR] pg_regress tests failed
2026-10-21 01:52:38 [ERROR] An error occurred. Exit code: 1
2026-10-21 01:52:38 [ERROR] Debug logs:
failed checks.aarch64-linux.psql_17 49s
run-check-harness-psql-17: 1 of 69 tests failed. ======================= The differences that caused some tests to fail can be viewed in the file "/nix/store/ …
run-check-harness-psql-17:
 1 of 69 tests failed. 
=======================
The differences that caused some tests to fail can be viewed in the
file "/nix/store/40jdjhksr1cyrlvwwwi83wbh2f58jwj5-run-check-harness-psql-17/regression_output/regression.diffs".  A copy of the test summary that you see
above is saved in the file "/nix/store/40jdjhksr1cyrlvwwwi83wbh2f58jwj5-run-check-harness-psql-17/regression_output/regression.out".
2026-10-21 01:50:46 [ERROR] pg_regress tests failed
2026-10-21 01:50:46 [ERROR] An error occurred. Exit code: 1
2026-10-21 01:50:46 [ERROR] Debug logs:
failed checks.aarch64-linux.psql_17_slim 48s
run-check-harness-psql-17-slim: 1 of 69 tests failed. ======================= The differences that caused some tests to fail can be viewed in the file "/nix/s …
run-check-harness-psql-17-slim:
 1 of 69 tests failed. 
=======================
The differences that caused some tests to fail can be viewed in the
file "/nix/store/6n9z2l6rlyr7iv11vp977qk733hz4rc0-run-check-harness-psql-17-slim/regression_output/regression.diffs".  A copy of the test summary that you see
above is saved in the file "/nix/store/6n9z2l6rlyr7iv11vp977qk733hz4rc0-run-check-harness-psql-17-slim/regression_output/regression.out".
2026-10-21 01:51:11 [ERROR] pg_regress tests failed
2026-10-21 01:51:11 [ERROR] An error occurred. Exit code: 1
2026-10-21 01:51:11 [ERROR] Debug logs:
failed checks.aarch64-linux.psql_orioledb-17 50s
run-check-harness-psql-orioledb-17: 1 of 66 tests failed. ======================= The differences that caused some tests to fail can be viewed in the file "/n …
run-check-harness-psql-orioledb-17:
 1 of 66 tests failed. 
=======================
The differences that caused some tests to fail can be viewed in the
file "/nix/store/lpq3isgn9ps0rm2rxsmlchw8crkcnkb5-run-check-harness-psql-orioledb-17/regression_output/regression.diffs".  A copy of the test summary that you see
above is saved in the file "/nix/store/lpq3isgn9ps0rm2rxsmlchw8crkcnkb5-run-check-harness-psql-orioledb-17/regression_output/regression.out".
2026-10-21 01:51:14 [ERROR] pg_regress tests failed
2026-10-21 01:51:14 [ERROR] An error occurred. Exit code: 1
2026-10-21 01:51:14 [ERROR] Debug logs:
failed checks.aarch64-linux.psql_orioledb-17_slim 49s
run-check-harness-psql-orioledb-17-slim: 1 of 66 tests failed. ======================= The differences that caused some tests to fail can be viewed in the fil …
run-check-harness-psql-orioledb-17-slim:
 1 of 66 tests failed. 
=======================
The differences that caused some tests to fail can be viewed in the
file "/nix/store/agqv9lqpncnbfp435c2rziy8zyz5w56r-run-check-harness-psql-orioledb-17-slim/regression_output/regression.diffs".  A copy of the test summary that you see
above is saved in the file "/nix/store/agqv9lqpncnbfp435c2rziy8zyz5w56r-run-check-harness-psql-orioledb-17-slim/regression_output/regression.out".
2026-10-21 01:51:59 [ERROR] pg_regress tests failed
2026-10-21 01:51:59 [ERROR] An error occurred. Exit code: 1
2026-10-21 01:51:59 [ERROR] Debug logs:
failed checks.x86_64-linux.psql_15 1m 3s
run-check-harness-psql-15: 1 of 73 tests failed. ======================= The differences that caused some tests to fail can be viewed in the file "/nix/store/ …
run-check-harness-psql-15:
 1 of 73 tests failed. 
=======================
The differences that caused some tests to fail can be viewed in the
file "/nix/store/8vyyfpnsvna7k5wi7xjgvli364v7prn6-run-check-harness-psql-15/regression_output/regression.diffs".  A copy of the test summary that you see
above is saved in the file "/nix/store/8vyyfpnsvna7k5wi7xjgvli364v7prn6-run-check-harness-psql-15/regression_output/regression.out".
2026-10-21 01:56:21 [ERROR] pg_regress tests failed
2026-10-21 01:56:21 [ERROR] An error occurred. Exit code: 1
2026-10-21 01:56:21 [ERROR] Debug logs:
failed checks.x86_64-linux.psql_15_slim 1m 3s
run-check-harness-psql-15-slim: 1 of 73 tests failed. ======================= The differences that caused some tests to fail can be viewed in the file "/nix/s …
run-check-harness-psql-15-slim:
 1 of 73 tests failed. 
=======================
The differences that caused some tests to fail can be viewed in the
file "/nix/store/r5bhrgb3c6pc3bvvpf381g5l0m4rnh2x-run-check-harness-psql-15-slim/regression_output/regression.diffs".  A copy of the test summary that you see
above is saved in the file "/nix/store/r5bhrgb3c6pc3bvvpf381g5l0m4rnh2x-run-check-harness-psql-15-slim/regression_output/regression.out".
2026-10-21 01:59:54 [ERROR] pg_regress tests failed
2026-10-21 01:59:54 [ERROR] An error occurred. Exit code: 1
2026-10-21 01:59:54 [ERROR] Debug logs:
failed checks.x86_64-linux.psql_17 35s
run-check-harness-psql-17: 1 of 69 tests failed. ======================= The differences that caused some tests to fail can be viewed in the file "/nix/store/ …
run-check-harness-psql-17:
 1 of 69 tests failed. 
=======================
The differences that caused some tests to fail can be viewed in the
file "/nix/store/sqs6pcb4cjswc4iav0awy57y2ppac2k1-run-check-harness-psql-17/regression_output/regression.diffs".  A copy of the test summary that you see
above is saved in the file "/nix/store/sqs6pcb4cjswc4iav0awy57y2ppac2k1-run-check-harness-psql-17/regression_output/regression.out".
2026-10-21 01:56:01 [ERROR] pg_regress tests failed
2026-10-21 01:56:01 [ERROR] An error occurred. Exit code: 1
2026-10-21 01:56:01 [ERROR] Debug logs:
failed checks.x86_64-linux.psql_17_slim 35s
run-check-harness-psql-17-slim: 1 of 69 tests failed. ======================= The differences that caused some tests to fail can be viewed in the file "/nix/s …
run-check-harness-psql-17-slim:
 1 of 69 tests failed. 
=======================
The differences that caused some tests to fail can be viewed in the
file "/nix/store/8jy396j6ijqdvvm4dvrqy54w7y78b34j-run-check-harness-psql-17-slim/regression_output/regression.diffs".  A copy of the test summary that you see
above is saved in the file "/nix/store/8jy396j6ijqdvvm4dvrqy54w7y78b34j-run-check-harness-psql-17-slim/regression_output/regression.out".
2026-10-21 01:56:43 [ERROR] pg_regress tests failed
2026-10-21 01:56:43 [ERROR] An error occurred. Exit code: 1
2026-10-21 01:56:43 [ERROR] Debug logs:
failed checks.x86_64-linux.psql_orioledb-17 36s
run-check-harness-psql-orioledb-17: 1 of 66 tests failed. ======================= The differences that caused some tests to fail can be viewed in the file "/n …
run-check-harness-psql-orioledb-17:
 1 of 66 tests failed. 
=======================
The differences that caused some tests to fail can be viewed in the
file "/nix/store/142qhhzhgb80bczxsms33ha7ch8x7a4l-run-check-harness-psql-orioledb-17/regression_output/regression.diffs".  A copy of the test summary that you see
above is saved in the file "/nix/store/142qhhzhgb80bczxsms33ha7ch8x7a4l-run-check-harness-psql-orioledb-17/regression_output/regression.out".
2026-10-21 01:59:32 [ERROR] pg_regress tests failed
2026-10-21 01:59:32 [ERROR] An error occurred. Exit code: 1
2026-10-21 01:59:32 [ERROR] Debug logs:
failed checks.x86_64-linux.psql_orioledb-17_slim 35s
run-check-harness-psql-orioledb-17-slim: 1 of 66 tests failed. ======================= The differences that caused some tests to fail can be viewed in the fil …
run-check-harness-psql-orioledb-17-slim:
 1 of 66 tests failed. 
=======================
The differences that caused some tests to fail can be viewed in the
file "/nix/store/an0rq3k7d2jnyys4clfx3rdy9wsy3vag-run-check-harness-psql-orioledb-17-slim/regression_output/regression.diffs".  A copy of the test summary that you see
above is saved in the file "/nix/store/an0rq3k7d2jnyys4clfx3rdy9wsy3vag-run-check-harness-psql-orioledb-17-slim/regression_output/regression.out".
2026-10-21 01:59:23 [ERROR] pg_regress tests failed
2026-10-21 01:59:23 [ERROR] An error occurred. Exit code: 1
2026-10-21 01:59:23 [ERROR] Debug logs:
76 succeeded
succeeded attributes
status attribute duration
loading…
44 already built
skipped attributes
status attribute duration
loading…