these 3 derivations will be built: /nix/store/mgzdqz7y6bmawg2xnq74ha1r1pgwmbq7-start-postgres-server-test.drv /nix/store/gl108ri5qihxwpxifpmf3dmmldvf458f-postgres-orioledb-17-check-harness.drv /nix/store/3isdimwl76m1kpclaj538mvypa5vk8sg-run-check-harness-psql-orioledb-17.drv error: Cannot build '/nix/store/3isdimwl76m1kpclaj538mvypa5vk8sg-run-check-harness-psql-orioledb-17.drv'. Reason: builder failed with exit code 1. Output paths: /nix/store/142qhhzhgb80bczxsms33ha7ch8x7a4l-run-check-harness-psql-orioledb-17 Last 25 log lines: > test wal2json ... ok 18 ms > test z_orioledb-17_docs-cascades-deletes ... ok 83 ms > test z_orioledb-17_docs-full-text-search ... ok 31 ms > test z_orioledb-17_docs-functions ... ok 343 ms > test z_orioledb-17_docs-indexes ... ok 31 ms > test z_orioledb-17_docs-partitioning ... ok 38 ms > test z_orioledb-17_ext_interface ... ok 113 ms > test z_orioledb-17_extensions_schema ... ok 8 ms > test z_orioledb-17_intarray_ltree_query ... ok 9 ms > test z_orioledb-17_pg_stat_monitor ... ok 7 ms > test z_orioledb-17_pgroonga ... ok 56 ms > test z_orioledb-17_pgvector ... ok 18 ms > test z_orioledb-17_verify_orioledb ... ok 16 ms > > ======================= > 1 of 66 tests failed. > ======================= > > The differences that caused some tests to fail can be viewed in the > file "/nix/store/142qhhzhgb80bczxsms33ha7ch8x7a4l-run-check-harness-psql-orioledb-17/regression_output/regression.diffs". A copy of the test summary that you see > above is saved in the file "/nix/store/142qhhzhgb80bczxsms33ha7ch8x7a4l-run-check-harness-psql-orioledb-17/regression_output/regression.out". > > 2026-10-21 01:59:32 [ERROR] pg_regress tests failed > 2026-10-21 01:59:32 [ERROR] An error occurred. Exit code: 1 > 2026-10-21 01:59:32 [ERROR] Debug logs: For full logs, run: nix log /nix/store/3isdimwl76m1kpclaj538mvypa5vk8sg-run-check-harness-psql-orioledb-17.drv