setup
checks.x86_64-linux.psql_17_slim
· build #405
· raw
1these 3 derivations will be built:2 /nix/store/j4jb8spsppzkhfc7iflbhm8jx4g94jj5-start-postgres-server-test.drv3 /nix/store/ixvnzyqdld1yfw8af0zqcxw413mlj5s0-postgres-17-check-harness.drv4 /nix/store/jg2q1flsq2a304jnaj6764sm4jr59zq3-run-check-harness-psql-17-slim.drv5error: Cannot build '/nix/store/jg2q1flsq2a304jnaj6764sm4jr59zq3-run-check-harness-psql-17-slim.drv'.6 Reason: builder failed with exit code 1.7 Output paths:8 /nix/store/8jy396j6ijqdvvm4dvrqy54w7y78b34j-run-check-harness-psql-17-slim9 Last 25 log lines:10 > test roles ... FAILED 11 ms11 > test security ... ok 10 ms12 > test storage ... ok 15 ms13 > test supautils_reserved_roles ... ok 8 ms14 > test supautils_restrict_versions ... ok 79 ms15 > test vault ... ok 27 ms16 > test wal2json ... ok 14 ms17 > test z_17_ext_interface ... ok 113 ms18 > test z_17_intarray_ltree_query ... ok 12 ms19 > test z_17_pg_stat_monitor ... ok 8 ms20 > test z_17_pgvector ... ok 12 ms21 > test z_17_roles ... ok 14 ms22 > test z_17_rum ... ok 13 ms23 >24 > =======================25 > 1 of 69 tests failed.26 > =======================27 >28 > The differences that caused some tests to fail can be viewed in the29 > file "/nix/store/8jy396j6ijqdvvm4dvrqy54w7y78b34j-run-check-harness-psql-17-slim/regression_output/regression.diffs". A copy of the test summary that you see30 > above is saved in the file "/nix/store/8jy396j6ijqdvvm4dvrqy54w7y78b34j-run-check-harness-psql-17-slim/regression_output/regression.out".31 >32 > 2026-10-21 01:56:43 [ERROR] pg_regress tests failed33 > 2026-10-21 01:56:43 [ERROR] An error occurred. Exit code: 134 > 2026-10-21 01:56:43 [ERROR] Debug logs:35 For full logs, run:36 nix log /nix/store/jg2q1flsq2a304jnaj6764sm4jr59zq3-run-check-harness-psql-17-slim.drv