these 3 derivations will be built: /nix/store/j4jb8spsppzkhfc7iflbhm8jx4g94jj5-start-postgres-server-test.drv /nix/store/ixvnzyqdld1yfw8af0zqcxw413mlj5s0-postgres-17-check-harness.drv /nix/store/jg2q1flsq2a304jnaj6764sm4jr59zq3-run-check-harness-psql-17-slim.drv error: Cannot build '/nix/store/jg2q1flsq2a304jnaj6764sm4jr59zq3-run-check-harness-psql-17-slim.drv'. Reason: builder failed with exit code 1. Output paths: /nix/store/8jy396j6ijqdvvm4dvrqy54w7y78b34j-run-check-harness-psql-17-slim Last 25 log lines: > test roles ... FAILED 11 ms > test security ... ok 10 ms > test storage ... ok 15 ms > test supautils_reserved_roles ... ok 8 ms > test supautils_restrict_versions ... ok 79 ms > test vault ... ok 27 ms > test wal2json ... ok 14 ms > test z_17_ext_interface ... ok 113 ms > test z_17_intarray_ltree_query ... ok 12 ms > test z_17_pg_stat_monitor ... ok 8 ms > test z_17_pgvector ... ok 12 ms > test z_17_roles ... ok 14 ms > test z_17_rum ... ok 13 ms > > ======================= > 1 of 69 tests failed. > ======================= > > The differences that caused some tests to fail can be viewed in the > file "/nix/store/8jy396j6ijqdvvm4dvrqy54w7y78b34j-run-check-harness-psql-17-slim/regression_output/regression.diffs". A copy of the test summary that you see > above is saved in the file "/nix/store/8jy396j6ijqdvvm4dvrqy54w7y78b34j-run-check-harness-psql-17-slim/regression_output/regression.out". > > 2026-10-21 01:56:43 [ERROR] pg_regress tests failed > 2026-10-21 01:56:43 [ERROR] An error occurred. Exit code: 1 > 2026-10-21 01:56:43 [ERROR] Debug logs: For full logs, run: nix log /nix/store/jg2q1flsq2a304jnaj6764sm4jr59zq3-run-check-harness-psql-17-slim.drv