nixbot

builds
1these 3 derivations will be built:2 /nix/store/967znnmf3g94c47a6aqq3n2zfbrbx4hc-start-postgres-server-test.drv3 /nix/store/p91qixp89wh5dyw5ri52wlzvwd7ivybp-postgres-17-check-harness.drv4 /nix/store/q0jl6zndb7wihvvgsbrwi9hjh8xx7dc9-run-check-harness-psql-17.drv5error: Cannot build '/nix/store/q0jl6zndb7wihvvgsbrwi9hjh8xx7dc9-run-check-harness-psql-17.drv'.6 Reason: builder failed with exit code 1.7 Output paths:8 /nix/store/sqs6pcb4cjswc4iav0awy57y2ppac2k1-run-check-harness-psql-179 Last 25 log lines:10 > test roles ... FAILED 11 ms11 > test security ... ok 12 ms12 > test storage ... ok 16 ms13 > test supautils_reserved_roles ... ok 9 ms14 > test supautils_restrict_versions ... ok 81 ms15 > test vault ... ok 28 ms16 > test wal2json ... ok 15 ms17 > test z_17_ext_interface ... ok 111 ms18 > test z_17_intarray_ltree_query ... ok 15 ms19 > test z_17_pg_stat_monitor ... ok 8 ms20 > test z_17_pgvector ... ok 12 ms21 > test z_17_roles ... ok 14 ms22 > test z_17_rum ... ok 15 ms23 >24 > =======================25 > 1 of 69 tests failed.26 > =======================27 >28 > The differences that caused some tests to fail can be viewed in the29 > file "/nix/store/sqs6pcb4cjswc4iav0awy57y2ppac2k1-run-check-harness-psql-17/regression_output/regression.diffs". A copy of the test summary that you see30 > above is saved in the file "/nix/store/sqs6pcb4cjswc4iav0awy57y2ppac2k1-run-check-harness-psql-17/regression_output/regression.out".31 >32 > 2026-10-21 01:56:01 [ERROR] pg_regress tests failed33 > 2026-10-21 01:56:01 [ERROR] An error occurred. Exit code: 134 > 2026-10-21 01:56:01 [ERROR] Debug logs:35 For full logs, run:36 nix log /nix/store/q0jl6zndb7wihvvgsbrwi9hjh8xx7dc9-run-check-harness-psql-17.drv