these 3 derivations will be built: /nix/store/967znnmf3g94c47a6aqq3n2zfbrbx4hc-start-postgres-server-test.drv /nix/store/p91qixp89wh5dyw5ri52wlzvwd7ivybp-postgres-17-check-harness.drv /nix/store/q0jl6zndb7wihvvgsbrwi9hjh8xx7dc9-run-check-harness-psql-17.drv error: Cannot build '/nix/store/q0jl6zndb7wihvvgsbrwi9hjh8xx7dc9-run-check-harness-psql-17.drv'. Reason: builder failed with exit code 1. Output paths: /nix/store/sqs6pcb4cjswc4iav0awy57y2ppac2k1-run-check-harness-psql-17 Last 25 log lines: > test roles ... FAILED 11 ms > test security ... ok 12 ms > test storage ... ok 16 ms > test supautils_reserved_roles ... ok 9 ms > test supautils_restrict_versions ... ok 81 ms > test vault ... ok 28 ms > test wal2json ... ok 15 ms > test z_17_ext_interface ... ok 111 ms > test z_17_intarray_ltree_query ... ok 15 ms > test z_17_pg_stat_monitor ... ok 8 ms > test z_17_pgvector ... ok 12 ms > test z_17_roles ... ok 14 ms > test z_17_rum ... ok 15 ms > > ======================= > 1 of 69 tests failed. > ======================= > > The differences that caused some tests to fail can be viewed in the > file "/nix/store/sqs6pcb4cjswc4iav0awy57y2ppac2k1-run-check-harness-psql-17/regression_output/regression.diffs". A copy of the test summary that you see > above is saved in the file "/nix/store/sqs6pcb4cjswc4iav0awy57y2ppac2k1-run-check-harness-psql-17/regression_output/regression.out". > > 2026-10-21 01:56:01 [ERROR] pg_regress tests failed > 2026-10-21 01:56:01 [ERROR] An error occurred. Exit code: 1 > 2026-10-21 01:56:01 [ERROR] Debug logs: For full logs, run: nix log /nix/store/q0jl6zndb7wihvvgsbrwi9hjh8xx7dc9-run-check-harness-psql-17.drv