setup
checks.x86_64-linux.psql_15_slim
· build #405
· raw
1these 3 derivations will be built:2 /nix/store/7fj4l2dgzz4v2gmqikr59fk7q8084nw8-start-postgres-server-test.drv3 /nix/store/mp2b6ng2svs5rnixdfg0fbba7r6889dz-postgres-15-check-harness.drv4 /nix/store/1ifc7xh9p3yd44zsrk0wlci3vw8zs4ka-run-check-harness-psql-15-slim.drv5error: Cannot build '/nix/store/1ifc7xh9p3yd44zsrk0wlci3vw8zs4ka-run-check-harness-psql-15-slim.drv'.6 Reason: builder failed with exit code 1.7 Output paths:8 /nix/store/r5bhrgb3c6pc3bvvpf381g5l0m4rnh2x-run-check-harness-psql-15-slim9 Last 25 log lines:10 > test supautils_restrict_versions ... ok 85 ms11 > test vault ... ok 27 ms12 > test wal2json ... ok 15 ms13 > test z_15_ext_interface ... ok 657 ms14 > test z_15_intarray_ltree_query ... ok 11 ms15 > test z_15_pg_stat_monitor ... ok 12 ms16 > test z_15_pgjwt ... ok 17 ms17 > test z_15_pgvector ... ok 32 ms18 > test z_15_plv8 ... ok 50 ms19 > test z_15_roles ... ok 15 ms20 > test z_15_rum ... ok 18 ms21 > test z_15_timescale ... ok 22 ms22 > test z_15_unhype_timescale_to_partman ... ok 11739 ms23 >24 > =======================25 > 1 of 73 tests failed.26 > =======================27 >28 > The differences that caused some tests to fail can be viewed in the29 > file "/nix/store/r5bhrgb3c6pc3bvvpf381g5l0m4rnh2x-run-check-harness-psql-15-slim/regression_output/regression.diffs". A copy of the test summary that you see30 > above is saved in the file "/nix/store/r5bhrgb3c6pc3bvvpf381g5l0m4rnh2x-run-check-harness-psql-15-slim/regression_output/regression.out".31 >32 > 2026-10-21 01:59:54 [ERROR] pg_regress tests failed33 > 2026-10-21 01:59:54 [ERROR] An error occurred. Exit code: 134 > 2026-10-21 01:59:54 [ERROR] Debug logs:35 For full logs, run:36 nix log /nix/store/1ifc7xh9p3yd44zsrk0wlci3vw8zs4ka-run-check-harness-psql-15-slim.drv