these 3 derivations will be built: /nix/store/7fj4l2dgzz4v2gmqikr59fk7q8084nw8-start-postgres-server-test.drv /nix/store/mp2b6ng2svs5rnixdfg0fbba7r6889dz-postgres-15-check-harness.drv /nix/store/1ifc7xh9p3yd44zsrk0wlci3vw8zs4ka-run-check-harness-psql-15-slim.drv error: Cannot build '/nix/store/1ifc7xh9p3yd44zsrk0wlci3vw8zs4ka-run-check-harness-psql-15-slim.drv'. Reason: builder failed with exit code 1. Output paths: /nix/store/r5bhrgb3c6pc3bvvpf381g5l0m4rnh2x-run-check-harness-psql-15-slim Last 25 log lines: > test supautils_restrict_versions ... ok 85 ms > test vault ... ok 27 ms > test wal2json ... ok 15 ms > test z_15_ext_interface ... ok 657 ms > test z_15_intarray_ltree_query ... ok 11 ms > test z_15_pg_stat_monitor ... ok 12 ms > test z_15_pgjwt ... ok 17 ms > test z_15_pgvector ... ok 32 ms > test z_15_plv8 ... ok 50 ms > test z_15_roles ... ok 15 ms > test z_15_rum ... ok 18 ms > test z_15_timescale ... ok 22 ms > test z_15_unhype_timescale_to_partman ... ok 11739 ms > > ======================= > 1 of 73 tests failed. > ======================= > > The differences that caused some tests to fail can be viewed in the > file "/nix/store/r5bhrgb3c6pc3bvvpf381g5l0m4rnh2x-run-check-harness-psql-15-slim/regression_output/regression.diffs". A copy of the test summary that you see > above is saved in the file "/nix/store/r5bhrgb3c6pc3bvvpf381g5l0m4rnh2x-run-check-harness-psql-15-slim/regression_output/regression.out". > > 2026-10-21 01:59:54 [ERROR] pg_regress tests failed > 2026-10-21 01:59:54 [ERROR] An error occurred. Exit code: 1 > 2026-10-21 01:59:54 [ERROR] Debug logs: For full logs, run: nix log /nix/store/1ifc7xh9p3yd44zsrk0wlci3vw8zs4ka-run-check-harness-psql-15-slim.drv