nixbot

builds
1these 3 derivations will be built:2 /nix/store/a8nz722gzfiv1pfsmzi919gnvh14m0nr-start-postgres-server-test.drv3 /nix/store/gvlj8n02rg2zb6ngdbfqhya4wjp461dg-postgres-15-check-harness.drv4 /nix/store/0967aq15wsmqw0snldd1bivv9jiq3jy6-run-check-harness-psql-15.drv5error: Cannot build '/nix/store/0967aq15wsmqw0snldd1bivv9jiq3jy6-run-check-harness-psql-15.drv'.6 Reason: builder failed with exit code 1.7 Output paths:8 /nix/store/8vyyfpnsvna7k5wi7xjgvli364v7prn6-run-check-harness-psql-159 Last 25 log lines:10 > test supautils_restrict_versions ... ok 83 ms11 > test vault ... ok 28 ms12 > test wal2json ... ok 14 ms13 > test z_15_ext_interface ... ok 678 ms14 > test z_15_intarray_ltree_query ... ok 12 ms15 > test z_15_pg_stat_monitor ... ok 11 ms16 > test z_15_pgjwt ... ok 17 ms17 > test z_15_pgvector ... ok 33 ms18 > test z_15_plv8 ... ok 49 ms19 > test z_15_roles ... ok 19 ms20 > test z_15_rum ... ok 19 ms21 > test z_15_timescale ... ok 25 ms22 > test z_15_unhype_timescale_to_partman ... ok 11760 ms23 >24 > =======================25 > 1 of 73 tests failed.26 > =======================27 >28 > The differences that caused some tests to fail can be viewed in the29 > file "/nix/store/8vyyfpnsvna7k5wi7xjgvli364v7prn6-run-check-harness-psql-15/regression_output/regression.diffs". A copy of the test summary that you see30 > above is saved in the file "/nix/store/8vyyfpnsvna7k5wi7xjgvli364v7prn6-run-check-harness-psql-15/regression_output/regression.out".31 >32 > 2026-10-21 01:56:21 [ERROR] pg_regress tests failed33 > 2026-10-21 01:56:21 [ERROR] An error occurred. Exit code: 134 > 2026-10-21 01:56:21 [ERROR] Debug logs:35 For full logs, run:36 nix log /nix/store/0967aq15wsmqw0snldd1bivv9jiq3jy6-run-check-harness-psql-15.drv