these 3 derivations will be built: /nix/store/a8nz722gzfiv1pfsmzi919gnvh14m0nr-start-postgres-server-test.drv /nix/store/gvlj8n02rg2zb6ngdbfqhya4wjp461dg-postgres-15-check-harness.drv /nix/store/0967aq15wsmqw0snldd1bivv9jiq3jy6-run-check-harness-psql-15.drv error: Cannot build '/nix/store/0967aq15wsmqw0snldd1bivv9jiq3jy6-run-check-harness-psql-15.drv'. Reason: builder failed with exit code 1. Output paths: /nix/store/8vyyfpnsvna7k5wi7xjgvli364v7prn6-run-check-harness-psql-15 Last 25 log lines: > test supautils_restrict_versions ... ok 83 ms > test vault ... ok 28 ms > test wal2json ... ok 14 ms > test z_15_ext_interface ... ok 678 ms > test z_15_intarray_ltree_query ... ok 12 ms > test z_15_pg_stat_monitor ... ok 11 ms > test z_15_pgjwt ... ok 17 ms > test z_15_pgvector ... ok 33 ms > test z_15_plv8 ... ok 49 ms > test z_15_roles ... ok 19 ms > test z_15_rum ... ok 19 ms > test z_15_timescale ... ok 25 ms > test z_15_unhype_timescale_to_partman ... ok 11760 ms > > ======================= > 1 of 73 tests failed. > ======================= > > The differences that caused some tests to fail can be viewed in the > file "/nix/store/8vyyfpnsvna7k5wi7xjgvli364v7prn6-run-check-harness-psql-15/regression_output/regression.diffs". A copy of the test summary that you see > above is saved in the file "/nix/store/8vyyfpnsvna7k5wi7xjgvli364v7prn6-run-check-harness-psql-15/regression_output/regression.out". > > 2026-10-21 01:56:21 [ERROR] pg_regress tests failed > 2026-10-21 01:56:21 [ERROR] An error occurred. Exit code: 1 > 2026-10-21 01:56:21 [ERROR] Debug logs: For full logs, run: nix log /nix/store/0967aq15wsmqw0snldd1bivv9jiq3jy6-run-check-harness-psql-15.drv