setup
checks.x86_64-linux.psql_orioledb-17
· build #37
· raw
1these 3 derivations will be built:2 /nix/store/42hi0azz2jhirls40vznqgcack13pg77-start-postgres-server-test.drv3 /nix/store/nkm0xpscxs33c9967b1gycl2ifgj9hbw-postgres-orioledb-17-check-harness.drv4 /nix/store/9789zjm9rr0vn6jinmnmnnbc4f7cxpq2-run-check-harness-psql-orioledb-17.drv5error: Cannot build '/nix/store/9789zjm9rr0vn6jinmnmnnbc4f7cxpq2-run-check-harness-psql-orioledb-17.drv'.6 Reason: builder failed with exit code 1.7 Output paths:8 /nix/store/2zlgds8sb2cynmp3jdlgayb8x98ag8py-run-check-harness-psql-orioledb-179 Last 25 log lines:10 > test wal2json ... ok 17 ms11 > test z_orioledb-17_docs-cascades-deletes ... ok 81 ms12 > test z_orioledb-17_docs-full-text-search ... ok 32 ms13 > test z_orioledb-17_docs-functions ... ok 341 ms14 > test z_orioledb-17_docs-indexes ... ok 27 ms15 > test z_orioledb-17_docs-partitioning ... ok 38 ms16 > test z_orioledb-17_ext_interface ... FAILED 110 ms17 > test z_orioledb-17_extensions_schema ... ok 8 ms18 > test z_orioledb-17_intarray_ltree_query ... ok 9 ms19 > test z_orioledb-17_pg_stat_monitor ... ok 7 ms20 > test z_orioledb-17_pgroonga ... ok 55 ms21 > test z_orioledb-17_pgvector ... ok 17 ms22 > test z_orioledb-17_verify_orioledb ... ok 15 ms23 >24 > =======================25 > 2 of 64 tests failed.26 > =======================27 >28 > The differences that caused some tests to fail can be viewed in the29 > file "/nix/store/2zlgds8sb2cynmp3jdlgayb8x98ag8py-run-check-harness-psql-orioledb-17/regression_output/regression.diffs". A copy of the test summary that you see30 > above is saved in the file "/nix/store/2zlgds8sb2cynmp3jdlgayb8x98ag8py-run-check-harness-psql-orioledb-17/regression_output/regression.out".31 >32 > 2026-10-05 10:58:52 [ERROR] pg_regress tests failed33 > 2026-10-05 10:58:52 [ERROR] An error occurred. Exit code: 134 > 2026-10-05 10:58:52 [ERROR] Debug logs:35 For full logs, run:36 nix log /nix/store/9789zjm9rr0vn6jinmnmnnbc4f7cxpq2-run-check-harness-psql-orioledb-17.drv